{"text_format":"1","workbook":"xlsx","n_sheets":4,"sheets":["Template 30 students","Template 50 students","Template 100 students","Calculations"],"not_rendered":{"charts":3,"images":1,"macros":1,"external_links":0,"defined_names":8,"comments":0,"pivot_tables":0},"unopened":[],"bounds":{"document_bytes":16777216,"sheet_cells":100000,"rows_first":2000,"rows_last":500,"rows_between":2000,"halvings":0,"cell_chars":16384,"cell_head_chars":4096},"cells_cut":0,"cells_raw":0,"read":"whole","date_system":"1900"}

{"sheet":"Template 30 students","index":0,"n_rows":51,"n_cols":5,"rows_kept":51,"cut":false,"hidden":false,"merged":[]}
[]
[null,"Etudiant","Temps 1","Temps 2","Taille d'effet"]
[null,"Anne-Lise",69.5,77.900000000000006,{"$f":"IFERROR(IF(COUNTA(B3,C3,D3)=3,(D3-C3)/$D$36,\"\"),\"\")","v":0.56346153673786714}]
[null,"Aurélie",67.400000000000006,100,2.1867673925779112]
[null,"Catherine",54.9,75.3,1.3684065892205335]
[null,"Catherine",41.7,79.2,2.5154532890083336]
[null,"Chantal",29,71.599999999999994,2.8575549363134667]
[null,"Claudine",78.900000000000006,73.7,-0.34880952274248911]
[null,"Corinne",64.2,61.1,-0.20794413855802235]
[null,"Jérémie",84.2,94.7,0.7043269209223334]
[null,"Justine",76.8,89.5,0.85190018054415584]
[null,"Marc",61.7,100,2.5691162925071778]
[null,"Marlène",84.2,83.2,-6.7078754373555566E-2]
[null,"Martin",85.9,97.9,0.80494505248266679]
[null,"Nathalie",80.2,100,1.3281593365964]
[null,"Véronique",70.7,100,1.9654075031451779]
[null,"Etudiant 14",null,null,""]
[null,"Etudiant 15",null,null,""]
[null,"Etudiant 16",null,null,""]
[null,"Etudiant 17",null,null,""]
[null,"Etudiant 18",null,null,""]
[null,"Etudiant 19",null,null,""]
[null,"Etudiant 20",null,null,""]
[null,"Etudiant 21",null,null,""]
[null,"Etudiant 22",null,null,""]
[null,"Etudiant 23",null,null,""]
[null,"Etudiant 24",null,null,""]
[null,"Etudiant 25",null,null,""]
[null,"Etudiant 26",null,null,""]
[null,"Etudiant 27",null,null,""]
[null,"Etudiant 28",null,null,""]
[null,"Etudiant 29",null,null,""]
[]
[null,"Moyenne",{"$f":"IF(C3=\"\",\"\",AVERAGE(C3:C33))","v":67.807142857142864},{"$f":"IF(C34=\"\",\"\",AVERAGE(D3:D33))","v":86.007142857142853},{"$f":"IF(C34=\"\",\"\",(D34-C34)/$D$36)","v":1.2208333295987106}]
[null,"Ecart type",{"$f":"IF(C34=\"\",\"\",STDEV(C3:C33))","v":16.729038056197773},{"$f":"IF(C34=\"\",\"\",STDEV(D3:D33))","v":13.086661693713793}]
[null,"Ecart moyen",null,{"$f":"IF(C34=\"\",\"\",AVERAGE(C35:D35))","v":14.907849874955783}]
[]
[]
[]
[]
[]
[]
[]
[]
[]
[]
[]
[]
[]
[null,"Source: https://www.visiblelearningplus.com"]
[null,"Adapté par C. Fantoli"]

{"sheet":"Template 50 students","index":1,"n_rows":57,"n_cols":5,"rows_kept":57,"cut":false,"hidden":false,"merged":[]}
[]
[null,"Student","Time 1","Time 2","Effect size"]
[null,"Student1",66,70,{"$f":"IFERROR(IF(COUNTA(B3,C3,D3)=3,(D3-C3)/$D$57,\"\"),\"\")","v":0.15669513928160111}]
[null,"Student2",83,84,3.9173784820400279E-2]
[null,"Student3",47,100,2.0762105954812147]
[null,"Student4",87,38,-1.9195154561996135]
[null,"Student5",99,98,-3.9173784820400279E-2]
[null,"Student6",94,61,-1.292734899073209]
[null,"Student7",96,71,-0.97934462051000692]
[null,"Student8",94,85,-0.35256406338360247]
[null,"Student9",38,41,0.11752135446120084]
[null,"Student10",79,90,0.43091163302440305]
[null,"Student11",86,79,-0.27421649374280194]
[null,"Student12",68,11,-2.2329057347628156]
[null,"Student13",76,67,-0.35256406338360247]
[null,"Student14",54,40,-0.54843298748560387]
[null,"Student15",21,26,0.19586892410200138]
[null,"Student16",99,80,-0.74430191158760528]
[null,"Student17",86,35,-1.9978630258404142]
[null,"Student18",58,20,-1.4886038231752106]
[null,"Student19",18,88,2.7421649374280195]
[null,"Student20",21,56,1.3710824687140097]
[null,"Student21",56,77,0.82264948122840575]
[null,"Student22",50,68,0.70512812676720493]
[null,"Student23",26,39,0.50925920266520364]
[null,"Student24",95,21,-2.8988600767096204]
[null,"Student25",22,57,1.3710824687140097]
[null,"Student26",48,82,1.3319086838936094]
[null,"Student27",70,23,-1.841167886558813]
[null,"Student28",80,28,-2.0370368106608145]
[null,"Student29",63,27,-1.4102562535344099]
[null,"Student30",59,11,-1.8803416713792134]
[null,"Student31",68,43,-0.97934462051000692]
[null,"Student32",63,64,3.9173784820400279E-2]
[null,"Student33",45,62,{"$f":"IFERROR(IF(COUNTA(B35,C35,D35)=3,(D35-C35)/$D$57,\"\"),\"\")","v":0.6659543419468047}]
[null,"Student34",50,39,-0.43091163302440305]
[null,"Student35",15,86,2.7813387222484196]
[null,"Student36",27,39,0.47008541784480334]
[null,"Student37",61,47,-0.54843298748560387]
[null,"Student38",21,22,3.9173784820400279E-2]
[null,"Student39",59,52,-0.27421649374280194]
[null,"Student40",45,17,-1.0968659749712077]
[null,"Student41",22,82,2.3504270892240164]
[null,"Student42",25,90,2.546296013326018]
[null,"Student43",68,81,0.50925920266520364]
[null,"Student44",76,61,-0.58760677230600411]
[null,"Student45",26,63,1.4494300383548102]
[null,"Student46",57,81,0.94017083568960669]
[null,"Student47",40,14,-1.0185184053304073]
[null,"Student48",75,90,0.58760677230600411]
[null,"Student49",40,38,-7.8347569640800557E-2]
[null,"Student50",40,39,-3.9173784820400279E-2]
[]
[]
[null,"Average",{"$f":"AVERAGE(Table13[Time 1])","v":57.24},{"$f":"AVERAGE(Table13[Time 2])","v":55.66},{"$f":"(D55-C55)/$D$57","v":-6.1894580016232652E-2}]
[null,"STDEV",{"$f":"STDEV(Table13[Time 1])","v":24.960834627594537},{"$f":"STDEV(Table13[Time 2])","v":26.093716500650622}]
[null,"AV Stdev",null,{"$f":"AVERAGE(C56:D56)","v":25.527275564122579}]

{"sheet":"Template 100 students","index":2,"n_rows":106,"n_cols":5,"rows_kept":106,"cut":false,"hidden":false,"merged":[]}
[]
[null,"Student","Time 1","Time 2","Effect size"]
[null,"Student1",21,22,{"$f":"IFERROR(IF(COUNTA(B3,C3,D3)=3,(D3-C3)/$D$106,\"\"),\"\")","v":0.16809435959377866}]
[null,"Student2",21,33,2.0171323151253437]
[null,"Student3",30,39,1.512849236344008]
[null,"Student4",36,34,-0.33618871918755733]
[null,"Student5",29,26,-0.50428307878133594]
[null,"Student6",24,20,-0.67237743837511466]
[null,"Student7",28,28,0]
[null,"Student8",22,30,1.3447548767502293]
[null,"Student9",29,21,-1.3447548767502293]
[null,"Student10",32,27,-0.84047179796889326]
[null,"Student11",22,27,0.84047179796889326]
[null,"Student12",28,23,-0.84047179796889326]
[null,"Student13",39,33,-1.0085661575626719]
[null,"Student14",32,28,-0.67237743837511466]
[null,"Student15",24,25,0.16809435959377866]
[null,"Student16",29,38,1.512849236344008]
[null,"Student17",23,24,0.16809435959377866]
[null,"Student18",30,31,0.16809435959377866]
[null,"Student19",22,24,0.33618871918755733]
[null,"Student20",24,28,0.67237743837511466]
[null,"Student21",33,33,0]
[null,"Student22",38,28,-1.6809435959377865]
[null,"Student23",25,25,0]
[null,"Student24",21,20,-0.16809435959377866]
[null,"Student25",39,34,-0.84047179796889326]
[null,"Student26",34,31,-0.50428307878133594]
[null,"Student27",37,28,-1.512849236344008]
[null,"Student28",21,31,1.6809435959377865]
[null,"Student29",22,32,1.6809435959377865]
[null,"Student30",25,29,0.67237743837511466]
[null,"Student31",36,30,-1.0085661575626719]
[null,"Student32",25,22,-0.50428307878133594]
[null,"Student33",36,29,{"$f":"IFERROR(IF(COUNTA(B35,C35,D35)=3,(D35-C35)/$D$106,\"\"),\"\")","v":-1.1766605171564506}]
[null,"Student34",22,39,2.8576041130942373]
[null,"Student35",25,23,-0.33618871918755733]
[null,"Student36",33,33,0]
[null,"Student37",26,39,2.1852266747191225]
[null,"Student38",26,21,-0.84047179796889326]
[null,"Student39",36,33,-0.50428307878133594]
[null,"Student40",35,31,-0.67237743837511466]
[null,"Student41",40,26,-2.3533210343129012]
[null,"Student42",21,35,2.3533210343129012]
[null,"Student43",25,20,-0.84047179796889326]
[null,"Student44",31,33,0.33618871918755733]
[null,"Student45",33,23,-1.6809435959377865]
[null,"Student46",33,35,0.33618871918755733]
[null,"Student47",27,31,0.67237743837511466]
[null,"Student48",34,25,-1.512849236344008]
[null,"Student49",40,27,-2.1852266747191225]
[null,"Student50",24,21,-0.50428307878133594]
[null,"Student51",40,22,-3.0256984726880161]
[null,"Student52",39,25,-2.3533210343129012]
[null,"Student53",31,22,-1.512849236344008]
[null,"Student54",33,24,-1.512849236344008]
[null,"Student55",27,35,1.3447548767502293]
[null,"Student56",40,23,-2.8576041130942373]
[null,"Student57",31,34,0.50428307878133594]
[null,"Student58",28,39,1.8490379555315652]
[null,"Student59",24,24,0]
[null,"Student60",39,28,-1.8490379555315652]
[null,"Student61",33,32,-0.16809435959377866]
[null,"Student62",33,39,1.0085661575626719]
[null,"Student63",40,25,-2.5214153939066799]
[null,"Student64",36,25,-1.8490379555315652]
[null,"Student65",20,30,{"$f":"IFERROR(IF(COUNTA(B67,C67,D67)=3,(D67-C67)/$D$106,\"\"),\"\")","v":1.6809435959377865}]
[null,"Student66",29,31,0.33618871918755733]
[null,"Student67",28,31,0.50428307878133594]
[null,"Student68",38,31,-1.1766605171564506]
[null,"Student69",37,30,-1.1766605171564506]
[null,"Student70",26,35,1.512849236344008]
[null,"Student71",21,34,2.1852266747191225]
[null,"Student72",39,28,-1.8490379555315652]
[null,"Student73",22,31,1.512849236344008]
[null,"Student74",26,36,1.6809435959377865]
[null,"Student75",23,29,1.0085661575626719]
[null,"Student76",31,36,0.84047179796889326]
[null,"Student77",20,32,2.0171323151253437]
[null,"Student78",32,40,1.3447548767502293]
[null,"Student79",38,38,0]
[null,"Student80",27,40,2.1852266747191225]
[null,"Student81",31,26,-0.84047179796889326]
[null,"Student82",30,28,-0.33618871918755733]
[null,"Student83",27,37,1.6809435959377865]
[null,"Student84",31,30,-0.16809435959377866]
[null,"Student85",24,37,2.1852266747191225]
[null,"Student86",21,21,0]
[null,"Student87",22,22,0]
[null,"Student88",40,30,-1.6809435959377865]
[null,"Student89",40,39,-0.16809435959377866]
[null,"Student90",29,32,0.50428307878133594]
[null,"Student91",34,32,-0.33618871918755733]
[null,"Student92",22,26,0.67237743837511466]
[null,"Student93",32,36,0.67237743837511466]
[null,"Student94",21,37,2.6895097535004586]
[null,"Student95",21,20,-0.16809435959377866]
[null,"Student96",29,22,-1.1766605171564506]
[null,"Student97",28,37,{"$f":"IFERROR(IF(COUNTA(B99,C99,D99)=3,(D99-C99)/$D$106,\"\"),\"\")","v":1.512849236344008}]
[null,"Student98",36,22,{"$f":"IFERROR(IF(COUNTA(B100,C100,D100)=3,(D100-C100)/$D$106,\"\"),\"\")","v":-2.3533210343129012}]
[null,"Student99",32,37,{"$f":"IFERROR(IF(COUNTA(B101,C101,D101)=3,(D101-C101)/$D$106,\"\"),\"\")","v":0.84047179796889326}]
[null,"Student100",30,38,{"$f":"IFERROR(IF(COUNTA(B102,C102,D102)=3,(D102-C102)/$D$106,\"\"),\"\")","v":1.3447548767502293}]
[]
[null,"Average",{"$f":"AVERAGE(C3:C102)","v":29.59},{"$f":"AVERAGE(D3:D102)","v":29.66},{"$f":"(D104-C104)/$D$106","v":1.1766605171564554E-2}]
[null,"STDEV",{"$f":"STDEV(C3:C102)","v":6.1645696680238125},{"$f":"STDEV(D3:D102)","v":5.733509511035221}]
[null,"AV Stdev",null,{"$f":"AVERAGE(C105:D105)","v":5.9490395895295167}]

{"sheet":"Calculations","index":3,"n_rows":108,"n_cols":18,"rows_kept":108,"cut":false,"hidden":true,"merged":[]}
["30 students",{"$f":"'Template 30 students'!E2","v":"Taille d'effet"},{"$f":"'Template 30 students'!D2","v":"Temps 2"},"Average Achievement","Average effect size",null,"50 students","effect size","Time 2","Average Achievement","Average effect size",null,"100 students","Effect size","Time 2","Average Achievement","Average effect size"]
[{"$f":"IF(COUNTA('Template 30 students'!B3)=1,('Template 30 students'!B3),\"\")","v":"Anne-Lise"},{"$f":"IF(COUNTA('Template 30 students'!E3)=1,('Template 30 students'!E3),\"\")","v":0.56346153673786714},{"$f":"IF(COUNTA('Template 30 students'!D3)=1,('Template 30 students'!D3),\"\")","v":77.900000000000006},{"$f":"IF(COUNTA('Template 30 students'!E3,'Template 30 students'!D3)=2,('Template 30 students'!$D$34),\"\")","v":86.007142857142853},{"$f":"IF(COUNTA('Template 30 students'!E3,'Template 30 students'!D3)=2,AVERAGE($B$2:$B$31),\"\")","v":1.2208333295987113},null,{"$f":"IF(COUNTA('Template 50 students'!B3)=1,('Template 50 students'!B3),\"\")","v":"Student1"},{"$f":"IF(COUNTA('Template 50 students'!E3)=1,('Template 50 students'!E3),\"\")","v":0.15669513928160111},{"$f":"IF(COUNTA('Template 50 students'!D3)=1,('Template 50 students'!D3),\"\")","v":70},{"$f":"IF(COUNTA('Template 50 students'!E3,'Template 50 students'!D3)=2,('Template 50 students'!$D$55),\"\")","v":55.66},{"$f":"IF(COUNTA('Template 50 students'!E3,'Template 50 students'!D3)=2,('Template 50 students'!$E$55),\"\")","v":-6.1894580016232652E-2},null,null,{"$f":"IF(COUNTA('Template 100 students'!E3)=1,('Template 100 students'!E3),\"\")","v":0.16809435959377866},{"$f":"IF(COUNTA('Template 100 students'!D3)=1,('Template 100 students'!D3),\"\")","v":22},{"$f":"IF(COUNTA('Template 100 students'!E3,'Template 100 students'!D3)=2,('Template 100 students'!$D$55),\"\")","v":22},{"$f":"IF(COUNTA('Template 100 students'!E3,'Template 100 students'!D3)=2,('Template 100 students'!$E$104),\"\")","v":1.1766605171564554E-2}]
[{"$f":"IF(COUNTA('Template 30 students'!B4)=1,('Template 30 students'!B4),\"\")","v":"Aurélie"},{"$f":"IF(COUNTA('Template 30 students'!E4)=1,('Template 30 students'!E4),\"\")","v":2.1867673925779112},{"$f":"IF(COUNTA('Template 30 students'!D4)=1,('Template 30 students'!D4),\"\")","v":100},{"$f":"IF(COUNTA('Template 30 students'!E4,'Template 30 students'!D4)=2,('Template 30 students'!$D$34),\"\")","v":86.007142857142853},{"$f":"IF(COUNTA('Template 30 students'!E4,'Template 30 students'!D4)=2,AVERAGE($B$2:$B$31),\"\")","v":1.2208333295987113},null,{"$f":"IF(COUNTA('Template 50 students'!B4)=1,('Template 50 students'!B4),\"\")","v":"Student2"},{"$f":"IF(COUNTA('Template 50 students'!E4)=1,('Template 50 students'!E4),\"\")","v":3.9173784820400279E-2},{"$f":"IF(COUNTA('Template 50 students'!D4)=1,('Template 50 students'!D4),\"\")","v":84},{"$f":"IF(COUNTA('Template 50 students'!E4,'Template 50 students'!D4)=2,('Template 50 students'!$D$55),\"\")","v":55.66},{"$f":"IF(COUNTA('Template 50 students'!E4,'Template 50 students'!D4)=2,('Template 50 students'!$E$55),\"\")","v":-6.1894580016232652E-2},null,null,{"$f":"'Template 100 students'!E4","v":2.0171323151253437},{"$f":"IF(COUNTA('Template 100 students'!D4)=1,('Template 100 students'!D4),\"\")","v":33},{"$f":"IF(COUNTA('Template 100 students'!E4,'Template 100 students'!D4)=2,('Template 100 students'!$D$55),\"\")","v":22},{"$f":"IF(COUNTA('Template 100 students'!E4,'Template 100 students'!D4)=2,('Template 100 students'!$E$104),\"\")","v":1.1766605171564554E-2}]
[{"$f":"IF(COUNTA('Template 30 students'!B5)=1,('Template 30 students'!B5),\"\")","v":"Catherine"},{"$f":"IF(COUNTA('Template 30 students'!E5)=1,('Template 30 students'!E5),\"\")","v":1.3684065892205335},{"$f":"IF(COUNTA('Template 30 students'!D5)=1,('Template 30 students'!D5),\"\")","v":75.3},{"$f":"IF(COUNTA('Template 30 students'!E5,'Template 30 students'!D5)=2,('Template 30 students'!$D$34),\"\")","v":86.007142857142853},{"$f":"IF(COUNTA('Template 30 students'!E5,'Template 30 students'!D5)=2,AVERAGE($B$2:$B$31),\"\")","v":1.2208333295987113},null,{"$f":"IF(COUNTA('Template 50 students'!B5)=1,('Template 50 students'!B5),\"\")","v":"Student3"},{"$f":"IF(COUNTA('Template 50 students'!E5)=1,('Template 50 students'!E5),\"\")","v":2.0762105954812147},{"$f":"IF(COUNTA('Template 50 students'!D5)=1,('Template 50 students'!D5),\"\")","v":100},{"$f":"IF(COUNTA('Template 50 students'!E5,'Template 50 students'!D5)=2,('Template 50 students'!$D$55),\"\")","v":55.66},{"$f":"IF(COUNTA('Template 50 students'!E5,'Template 50 students'!D5)=2,('Template 50 students'!$E$55),\"\")","v":-6.1894580016232652E-2},null,null,{"$f":"'Template 100 students'!E5","v":1.512849236344008},{"$f":"IF(COUNTA('Template 100 students'!D5)=1,('Template 100 students'!D5),\"\")","v":39},{"$f":"IF(COUNTA('Template 100 students'!E5,'Template 100 students'!D5)=2,('Template 100 students'!$D$55),\"\")","v":22},{"$f":"IF(COUNTA('Template 100 students'!E5,'Template 100 students'!D5)=2,('Template 100 students'!$E$104),\"\")","v":1.1766605171564554E-2}]
[{"$f":"IF(COUNTA('Template 30 students'!B6)=1,('Template 30 students'!B6),\"\")","v":"Catherine"},{"$f":"IF(COUNTA('Template 30 students'!E6)=1,('Template 30 students'!E6),\"\")","v":2.5154532890083336},{"$f":"IF(COUNTA('Template 30 students'!D6)=1,('Template 30 students'!D6),\"\")","v":79.2},{"$f":"IF(COUNTA('Template 30 students'!E6,'Template 30 students'!D6)=2,('Template 30 students'!$D$34),\"\")","v":86.007142857142853},{"$f":"IF(COUNTA('Template 30 students'!E6,'Template 30 students'!D6)=2,AVERAGE($B$2:$B$31),\"\")","v":1.2208333295987113},null,{"$f":"IF(COUNTA('Template 50 students'!B6)=1,('Template 50 students'!B6),\"\")","v":"Student4"},{"$f":"IF(COUNTA('Template 50 students'!E6)=1,('Template 50 students'!E6),\"\")","v":-1.9195154561996135},{"$f":"IF(COUNTA('Template 50 students'!D6)=1,('Template 50 students'!D6),\"\")","v":38},{"$f":"IF(COUNTA('Template 50 students'!E6,'Template 50 students'!D6)=2,('Template 50 students'!$D$55),\"\")","v":55.66},{"$f":"IF(COUNTA('Template 50 students'!E6,'Template 50 students'!D6)=2,('Template 50 students'!$E$55),\"\")","v":-6.1894580016232652E-2},null,null,{"$f":"'Template 100 students'!E6","v":-0.33618871918755733},{"$f":"IF(COUNTA('Template 100 students'!D6)=1,('Template 100 students'!D6),\"\")","v":34},{"$f":"IF(COUNTA('Template 100 students'!E6,'Template 100 students'!D6)=2,('Template 100 students'!$D$55),\"\")","v":22},{"$f":"IF(COUNTA('Template 100 students'!E6,'Template 100 students'!D6)=2,('Template 100 students'!$E$104),\"\")","v":1.1766605171564554E-2}]
[{"$f":"IF(COUNTA('Template 30 students'!B7)=1,('Template 30 students'!B7),\"\")","v":"Chantal"},{"$f":"IF(COUNTA('Template 30 students'!E7)=1,('Template 30 students'!E7),\"\")","v":2.8575549363134667},{"$f":"IF(COUNTA('Template 30 students'!D7)=1,('Template 30 students'!D7),\"\")","v":71.599999999999994},{"$f":"IF(COUNTA('Template 30 students'!E7,'Template 30 students'!D7)=2,('Template 30 students'!$D$34),\"\")","v":86.007142857142853},{"$f":"IF(COUNTA('Template 30 students'!E7,'Template 30 students'!D7)=2,AVERAGE($B$2:$B$31),\"\")","v":1.2208333295987113},null,{"$f":"IF(COUNTA('Template 50 students'!B7)=1,('Template 50 students'!B7),\"\")","v":"Student5"},{"$f":"IF(COUNTA('Template 50 students'!E7)=1,('Template 50 students'!E7),\"\")","v":-3.9173784820400279E-2},{"$f":"IF(COUNTA('Template 50 students'!D7)=1,('Template 50 students'!D7),\"\")","v":98},{"$f":"IF(COUNTA('Template 50 students'!E7,'Template 50 students'!D7)=2,('Template 50 students'!$D$55),\"\")","v":55.66},{"$f":"IF(COUNTA('Template 50 students'!E7,'Template 50 students'!D7)=2,('Template 50 students'!$E$55),\"\")","v":-6.1894580016232652E-2},null,null,{"$f":"'Template 100 students'!E7","v":-0.50428307878133594},{"$f":"IF(COUNTA('Template 100 students'!D7)=1,('Template 100 students'!D7),\"\")","v":26},{"$f":"IF(COUNTA('Template 100 students'!E7,'Template 100 students'!D7)=2,('Template 100 students'!$D$55),\"\")","v":22},{"$f":"IF(COUNTA('Template 100 students'!E7,'Template 100 students'!D7)=2,('Template 100 students'!$E$104),\"\")","v":1.1766605171564554E-2}]
[{"$f":"IF(COUNTA('Template 30 students'!B8)=1,('Template 30 students'!B8),\"\")","v":"Claudine"},{"$f":"IF(COUNTA('Template 30 students'!E8)=1,('Template 30 students'!E8),\"\")","v":-0.34880952274248911},{"$f":"IF(COUNTA('Template 30 students'!D8)=1,('Template 30 students'!D8),\"\")","v":73.7},{"$f":"IF(COUNTA('Template 30 students'!E8,'Template 30 students'!D8)=2,('Template 30 students'!$D$34),\"\")","v":86.007142857142853},{"$f":"IF(COUNTA('Template 30 students'!E8,'Template 30 students'!D8)=2,AVERAGE($B$2:$B$31),\"\")","v":1.2208333295987113},null,{"$f":"IF(COUNTA('Template 50 students'!B8)=1,('Template 50 students'!B8),\"\")","v":"Student6"},{"$f":"IF(COUNTA('Template 50 students'!E8)=1,('Template 50 students'!E8),\"\")","v":-1.292734899073209},{"$f":"IF(COUNTA('Template 50 students'!D8)=1,('Template 50 students'!D8),\"\")","v":61},{"$f":"IF(COUNTA('Template 50 students'!E8,'Template 50 students'!D8)=2,('Template 50 students'!$D$55),\"\")","v":55.66},{"$f":"IF(COUNTA('Template 50 students'!E8,'Template 50 students'!D8)=2,('Template 50 students'!$E$55),\"\")","v":-6.1894580016232652E-2},null,null,{"$f":"'Template 100 students'!E8","v":-0.67237743837511466},{"$f":"IF(COUNTA('Template 100 students'!D8)=1,('Template 100 students'!D8),\"\")","v":20},{"$f":"IF(COUNTA('Template 100 students'!E8,'Template 100 students'!D8)=2,('Template 100 students'!$D$55),\"\")","v":22},{"$f":"IF(COUNTA('Template 100 students'!E8,'Template 100 students'!D8)=2,('Template 100 students'!$E$104),\"\")","v":1.1766605171564554E-2}]
[{"$f":"IF(COUNTA('Template 30 students'!B9)=1,('Template 30 students'!B9),\"\")","v":"Corinne"},{"$f":"IF(COUNTA('Template 30 students'!E9)=1,('Template 30 students'!E9),\"\")","v":-0.20794413855802235},{"$f":"IF(COUNTA('Template 30 students'!D9)=1,('Template 30 students'!D9),\"\")","v":61.1},{"$f":"IF(COUNTA('Template 30 students'!E9,'Template 30 students'!D9)=2,('Template 30 students'!$D$34),\"\")","v":86.007142857142853},{"$f":"IF(COUNTA('Template 30 students'!E9,'Template 30 students'!D9)=2,AVERAGE($B$2:$B$31),\"\")","v":1.2208333295987113},null,{"$f":"IF(COUNTA('Template 50 students'!B9)=1,('Template 50 students'!B9),\"\")","v":"Student7"},{"$f":"IF(COUNTA('Template 50 students'!E9)=1,('Template 50 students'!E9),\"\")","v":-0.97934462051000692},{"$f":"IF(COUNTA('Template 50 students'!D9)=1,('Template 50 students'!D9),\"\")","v":71},{"$f":"IF(COUNTA('Template 50 students'!E9,'Template 50 students'!D9)=2,('Template 50 students'!$D$55),\"\")","v":55.66},{"$f":"IF(COUNTA('Template 50 students'!E9,'Template 50 students'!D9)=2,('Template 50 students'!$E$55),\"\")","v":-6.1894580016232652E-2},null,null,{"$f":"'Template 100 students'!E9","v":0},{"$f":"IF(COUNTA('Template 100 students'!D9)=1,('Template 100 students'!D9),\"\")","v":28},{"$f":"IF(COUNTA('Template 100 students'!E9,'Template 100 students'!D9)=2,('Template 100 students'!$D$55),\"\")","v":22},{"$f":"IF(COUNTA('Template 100 students'!E9,'Template 100 students'!D9)=2,('Template 100 students'!$E$104),\"\")","v":1.1766605171564554E-2}]
[{"$f":"IF(COUNTA('Template 30 students'!B10)=1,('Template 30 students'!B10),\"\")","v":"Jérémie"},{"$f":"IF(COUNTA('Template 30 students'!E10)=1,('Template 30 students'!E10),\"\")","v":0.7043269209223334},{"$f":"IF(COUNTA('Template 30 students'!D10)=1,('Template 30 students'!D10),\"\")","v":94.7},{"$f":"IF(COUNTA('Template 30 students'!E10,'Template 30 students'!D10)=2,('Template 30 students'!$D$34),\"\")","v":86.007142857142853},{"$f":"IF(COUNTA('Template 30 students'!E10,'Template 30 students'!D10)=2,AVERAGE($B$2:$B$31),\"\")","v":1.2208333295987113},null,{"$f":"IF(COUNTA('Template 50 students'!B10)=1,('Template 50 students'!B10),\"\")","v":"Student8"},{"$f":"IF(COUNTA('Template 50 students'!E10)=1,('Template 50 students'!E10),\"\")","v":-0.35256406338360247},{"$f":"IF(COUNTA('Template 50 students'!D10)=1,('Template 50 students'!D10),\"\")","v":85},{"$f":"IF(COUNTA('Template 50 students'!E10,'Template 50 students'!D10)=2,('Template 50 students'!$D$55),\"\")","v":55.66},{"$f":"IF(COUNTA('Template 50 students'!E10,'Template 50 students'!D10)=2,('Template 50 students'!$E$55),\"\")","v":-6.1894580016232652E-2},null,null,{"$f":"'Template 100 students'!E10","v":1.3447548767502293},{"$f":"IF(COUNTA('Template 100 students'!D10)=1,('Template 100 students'!D10),\"\")","v":30},{"$f":"IF(COUNTA('Template 100 students'!E10,'Template 100 students'!D10)=2,('Template 100 students'!$D$55),\"\")","v":22},{"$f":"IF(COUNTA('Template 100 students'!E10,'Template 100 students'!D10)=2,('Template 100 students'!$E$104),\"\")","v":1.1766605171564554E-2}]
[{"$f":"IF(COUNTA('Template 30 students'!B11)=1,('Template 30 students'!B11),\"\")","v":"Justine"},{"$f":"IF(COUNTA('Template 30 students'!E11)=1,('Template 30 students'!E11),\"\")","v":0.85190018054415584},{"$f":"IF(COUNTA('Template 30 students'!D11)=1,('Template 30 students'!D11),\"\")","v":89.5},{"$f":"IF(COUNTA('Template 30 students'!E11,'Template 30 students'!D11)=2,('Template 30 students'!$D$34),\"\")","v":86.007142857142853},{"$f":"IF(COUNTA('Template 30 students'!E11,'Template 30 students'!D11)=2,AVERAGE($B$2:$B$31),\"\")","v":1.2208333295987113},null,{"$f":"IF(COUNTA('Template 50 students'!B11)=1,('Template 50 students'!B11),\"\")","v":"Student9"},{"$f":"IF(COUNTA('Template 50 students'!E11)=1,('Template 50 students'!E11),\"\")","v":0.11752135446120084},{"$f":"IF(COUNTA('Template 50 students'!D11)=1,('Template 50 students'!D11),\"\")","v":41},{"$f":"IF(COUNTA('Template 50 students'!E11,'Template 50 students'!D11)=2,('Template 50 students'!$D$55),\"\")","v":55.66},{"$f":"IF(COUNTA('Template 50 students'!E11,'Template 50 students'!D11)=2,('Template 50 students'!$E$55),\"\")","v":-6.1894580016232652E-2},null,null,{"$f":"'Template 100 students'!E11","v":-1.3447548767502293},{"$f":"IF(COUNTA('Template 100 students'!D11)=1,('Template 100 students'!D11),\"\")","v":21},{"$f":"IF(COUNTA('Template 100 students'!E11,'Template 100 students'!D11)=2,('Template 100 students'!$D$55),\"\")","v":22},{"$f":"IF(COUNTA('Template 100 students'!E11,'Template 100 students'!D11)=2,('Template 100 students'!$E$104),\"\")","v":1.1766605171564554E-2}]
[{"$f":"IF(COUNTA('Template 30 students'!B12)=1,('Template 30 students'!B12),\"\")","v":"Marc"},{"$f":"IF(COUNTA('Template 30 students'!E12)=1,('Template 30 students'!E12),\"\")","v":2.5691162925071778},{"$f":"IF(COUNTA('Template 30 students'!D12)=1,('Template 30 students'!D12),\"\")","v":100},{"$f":"IF(COUNTA('Template 30 students'!E12,'Template 30 students'!D12)=2,('Template 30 students'!$D$34),\"\")","v":86.007142857142853},{"$f":"IF(COUNTA('Template 30 students'!E12,'Template 30 students'!D12)=2,AVERAGE($B$2:$B$31),\"\")","v":1.2208333295987113},null,{"$f":"IF(COUNTA('Template 50 students'!B12)=1,('Template 50 students'!B12),\"\")","v":"Student10"},{"$f":"IF(COUNTA('Template 50 students'!E12)=1,('Template 50 students'!E12),\"\")","v":0.43091163302440305},{"$f":"IF(COUNTA('Template 50 students'!D12)=1,('Template 50 students'!D12),\"\")","v":90},{"$f":"IF(COUNTA('Template 50 students'!E12,'Template 50 students'!D12)=2,('Template 50 students'!$D$55),\"\")","v":55.66},{"$f":"IF(COUNTA('Template 50 students'!E12,'Template 50 students'!D12)=2,('Template 50 students'!$E$55),\"\")","v":-6.1894580016232652E-2},null,null,{"$f":"'Template 100 students'!E12","v":-0.84047179796889326},{"$f":"IF(COUNTA('Template 100 students'!D12)=1,('Template 100 students'!D12),\"\")","v":27},{"$f":"IF(COUNTA('Template 100 students'!E12,'Template 100 students'!D12)=2,('Template 100 students'!$D$55),\"\")","v":22},{"$f":"IF(COUNTA('Template 100 students'!E12,'Template 100 students'!D12)=2,('Template 100 students'!$E$104),\"\")","v":1.1766605171564554E-2}]
[{"$f":"IF(COUNTA('Template 30 students'!B13)=1,('Template 30 students'!B13),\"\")","v":"Marlène"},{"$f":"IF(COUNTA('Template 30 students'!E13)=1,('Template 30 students'!E13),\"\")","v":-6.7078754373555566E-2},{"$f":"IF(COUNTA('Template 30 students'!D13)=1,('Template 30 students'!D13),\"\")","v":83.2},{"$f":"IF(COUNTA('Template 30 students'!E13,'Template 30 students'!D13)=2,('Template 30 students'!$D$34),\"\")","v":86.007142857142853},{"$f":"IF(COUNTA('Template 30 students'!E13,'Template 30 students'!D13)=2,AVERAGE($B$2:$B$31),\"\")","v":1.2208333295987113},null,{"$f":"IF(COUNTA('Template 50 students'!B13)=1,('Template 50 students'!B13),\"\")","v":"Student11"},{"$f":"IF(COUNTA('Template 50 students'!E13)=1,('Template 50 students'!E13),\"\")","v":-0.27421649374280194},{"$f":"IF(COUNTA('Template 50 students'!D13)=1,('Template 50 students'!D13),\"\")","v":79},{"$f":"IF(COUNTA('Template 50 students'!E13,'Template 50 students'!D13)=2,('Template 50 students'!$D$55),\"\")","v":55.66},{"$f":"IF(COUNTA('Template 50 students'!E13,'Template 50 students'!D13)=2,('Template 50 students'!$E$55),\"\")","v":-6.1894580016232652E-2},null,null,{"$f":"'Template 100 students'!E13","v":0.84047179796889326},{"$f":"IF(COUNTA('Template 100 students'!D13)=1,('Template 100 students'!D13),\"\")","v":27},{"$f":"IF(COUNTA('Template 100 students'!E13,'Template 100 students'!D13)=2,('Template 100 students'!$D$55),\"\")","v":22},{"$f":"IF(COUNTA('Template 100 students'!E13,'Template 100 students'!D13)=2,('Template 100 students'!$E$104),\"\")","v":1.1766605171564554E-2}]
[{"$f":"IF(COUNTA('Template 30 students'!B14)=1,('Template 30 students'!B14),\"\")","v":"Martin"},{"$f":"IF(COUNTA('Template 30 students'!E14)=1,('Template 30 students'!E14),\"\")","v":0.80494505248266679},{"$f":"IF(COUNTA('Template 30 students'!D14)=1,('Template 30 students'!D14),\"\")","v":97.9},{"$f":"IF(COUNTA('Template 30 students'!E14,'Template 30 students'!D14)=2,('Template 30 students'!$D$34),\"\")","v":86.007142857142853},{"$f":"IF(COUNTA('Template 30 students'!E14,'Template 30 students'!D14)=2,AVERAGE($B$2:$B$31),\"\")","v":1.2208333295987113},null,{"$f":"IF(COUNTA('Template 50 students'!B14)=1,('Template 50 students'!B14),\"\")","v":"Student12"},{"$f":"IF(COUNTA('Template 50 students'!E14)=1,('Template 50 students'!E14),\"\")","v":-2.2329057347628156},{"$f":"IF(COUNTA('Template 50 students'!D14)=1,('Template 50 students'!D14),\"\")","v":11},{"$f":"IF(COUNTA('Template 50 students'!E14,'Template 50 students'!D14)=2,('Template 50 students'!$D$55),\"\")","v":55.66},{"$f":"IF(COUNTA('Template 50 students'!E14,'Template 50 students'!D14)=2,('Template 50 students'!$E$55),\"\")","v":-6.1894580016232652E-2},null,null,{"$f":"'Template 100 students'!E14","v":-0.84047179796889326},{"$f":"IF(COUNTA('Template 100 students'!D14)=1,('Template 100 students'!D14),\"\")","v":23},{"$f":"IF(COUNTA('Template 100 students'!E14,'Template 100 students'!D14)=2,('Template 100 students'!$D$55),\"\")","v":22},{"$f":"IF(COUNTA('Template 100 students'!E14,'Template 100 students'!D14)=2,('Template 100 students'!$E$104),\"\")","v":1.1766605171564554E-2}]
[{"$f":"IF(COUNTA('Template 30 students'!B15)=1,('Template 30 students'!B15),\"\")","v":"Nathalie"},{"$f":"IF(COUNTA('Template 30 students'!E15)=1,('Template 30 students'!E15),\"\")","v":1.3281593365964},{"$f":"IF(COUNTA('Template 30 students'!D15)=1,('Template 30 students'!D15),\"\")","v":100},{"$f":"IF(COUNTA('Template 30 students'!E15,'Template 30 students'!D15)=2,('Template 30 students'!$D$34),\"\")","v":86.007142857142853},{"$f":"IF(COUNTA('Template 30 students'!E15,'Template 30 students'!D15)=2,AVERAGE($B$2:$B$31),\"\")","v":1.2208333295987113},null,{"$f":"IF(COUNTA('Template 50 students'!B15)=1,('Template 50 students'!B15),\"\")","v":"Student13"},{"$f":"IF(COUNTA('Template 50 students'!E15)=1,('Template 50 students'!E15),\"\")","v":-0.35256406338360247},{"$f":"IF(COUNTA('Template 50 students'!D15)=1,('Template 50 students'!D15),\"\")","v":67},{"$f":"IF(COUNTA('Template 50 students'!E15,'Template 50 students'!D15)=2,('Template 50 students'!$D$55),\"\")","v":55.66},{"$f":"IF(COUNTA('Template 50 students'!E15,'Template 50 students'!D15)=2,('Template 50 students'!$E$55),\"\")","v":-6.1894580016232652E-2},null,null,{"$f":"'Template 100 students'!E15","v":-1.0085661575626719},{"$f":"IF(COUNTA('Template 100 students'!D15)=1,('Template 100 students'!D15),\"\")","v":33},{"$f":"IF(COUNTA('Template 100 students'!E15,'Template 100 students'!D15)=2,('Template 100 students'!$D$55),\"\")","v":22},{"$f":"IF(COUNTA('Template 100 students'!E15,'Template 100 students'!D15)=2,('Template 100 students'!$E$104),\"\")","v":1.1766605171564554E-2}]
[{"$f":"IF(COUNTA('Template 30 students'!B16)=1,('Template 30 students'!B16),\"\")","v":"Véronique"},{"$f":"IF(COUNTA('Template 30 students'!E16)=1,('Template 30 students'!E16),\"\")","v":1.9654075031451779},{"$f":"IF(COUNTA('Template 30 students'!D16)=1,('Template 30 students'!D16),\"\")","v":100},{"$f":"IF(COUNTA('Template 30 students'!E16,'Template 30 students'!D16)=2,('Template 30 students'!$D$34),\"\")","v":86.007142857142853},{"$f":"IF(COUNTA('Template 30 students'!E16,'Template 30 students'!D16)=2,AVERAGE($B$2:$B$31),\"\")","v":1.2208333295987113},null,{"$f":"IF(COUNTA('Template 50 students'!B16)=1,('Template 50 students'!B16),\"\")","v":"Student14"},{"$f":"IF(COUNTA('Template 50 students'!E16)=1,('Template 50 students'!E16),\"\")","v":-0.54843298748560387},{"$f":"IF(COUNTA('Template 50 students'!D16)=1,('Template 50 students'!D16),\"\")","v":40},{"$f":"IF(COUNTA('Template 50 students'!E16,'Template 50 students'!D16)=2,('Template 50 students'!$D$55),\"\")","v":55.66},{"$f":"IF(COUNTA('Template 50 students'!E16,'Template 50 students'!D16)=2,('Template 50 students'!$E$55),\"\")","v":-6.1894580016232652E-2},null,null,{"$f":"'Template 100 students'!E16","v":-0.67237743837511466},{"$f":"IF(COUNTA('Template 100 students'!D16)=1,('Template 100 students'!D16),\"\")","v":28},{"$f":"IF(COUNTA('Template 100 students'!E16,'Template 100 students'!D16)=2,('Template 100 students'!$D$55),\"\")","v":22},{"$f":"IF(COUNTA('Template 100 students'!E16,'Template 100 students'!D16)=2,('Template 100 students'!$E$104),\"\")","v":1.1766605171564554E-2}]
[{"$f":"IF(COUNTA('Template 30 students'!B17)=1,('Template 30 students'!B17),\"\")","v":"Etudiant 14"},{"$f":"IF(COUNTA('Template 30 students'!E17)=1,('Template 30 students'!E17),\"\")","v":""},{"$f":"IF(COUNTA('Template 30 students'!D17)=1,('Template 30 students'!D17),\"\")","v":""},{"$f":"IF(COUNTA('Template 30 students'!E17,'Template 30 students'!D17)=2,('Template 30 students'!$D$34),\"\")","v":""},{"$f":"IF(COUNTA('Template 30 students'!E17,'Template 30 students'!D17)=2,AVERAGE($B$2:$B$31),\"\")","v":""},null,{"$f":"IF(COUNTA('Template 50 students'!B17)=1,('Template 50 students'!B17),\"\")","v":"Student15"},{"$f":"IF(COUNTA('Template 50 students'!E17)=1,('Template 50 students'!E17),\"\")","v":0.19586892410200138},{"$f":"IF(COUNTA('Template 50 students'!D17)=1,('Template 50 students'!D17),\"\")","v":26},{"$f":"IF(COUNTA('Template 50 students'!E17,'Template 50 students'!D17)=2,('Template 50 students'!$D$55),\"\")","v":55.66},{"$f":"IF(COUNTA('Template 50 students'!E17,'Template 50 students'!D17)=2,('Template 50 students'!$E$55),\"\")","v":-6.1894580016232652E-2},null,null,{"$f":"'Template 100 students'!E17","v":0.16809435959377866},{"$f":"IF(COUNTA('Template 100 students'!D17)=1,('Template 100 students'!D17),\"\")","v":25},{"$f":"IF(COUNTA('Template 100 students'!E17,'Template 100 students'!D17)=2,('Template 100 students'!$D$55),\"\")","v":22},{"$f":"IF(COUNTA('Template 100 students'!E17,'Template 100 students'!D17)=2,('Template 100 students'!$E$104),\"\")","v":1.1766605171564554E-2}]
[{"$f":"IF(COUNTA('Template 30 students'!B18)=1,('Template 30 students'!B18),\"\")","v":"Etudiant 15"},{"$f":"IF(COUNTA('Template 30 students'!E18)=1,('Template 30 students'!E18),\"\")","v":""},{"$f":"IF(COUNTA('Template 30 students'!D18)=1,('Template 30 students'!D18),\"\")","v":""},{"$f":"IF(COUNTA('Template 30 students'!E18,'Template 30 students'!D18)=2,('Template 30 students'!$D$34),\"\")","v":""},{"$f":"IF(COUNTA('Template 30 students'!E18,'Template 30 students'!D18)=2,AVERAGE($B$2:$B$31),\"\")","v":""},null,{"$f":"IF(COUNTA('Template 50 students'!B18)=1,('Template 50 students'!B18),\"\")","v":"Student16"},{"$f":"IF(COUNTA('Template 50 students'!E18)=1,('Template 50 students'!E18),\"\")","v":-0.74430191158760528},{"$f":"IF(COUNTA('Template 50 students'!D18)=1,('Template 50 students'!D18),\"\")","v":80},{"$f":"IF(COUNTA('Template 50 students'!E18,'Template 50 students'!D18)=2,('Template 50 students'!$D$55),\"\")","v":55.66},{"$f":"IF(COUNTA('Template 50 students'!E18,'Template 50 students'!D18)=2,('Template 50 students'!$E$55),\"\")","v":-6.1894580016232652E-2},null,null,{"$f":"'Template 100 students'!E18","v":1.512849236344008},{"$f":"IF(COUNTA('Template 100 students'!D18)=1,('Template 100 students'!D18),\"\")","v":38},{"$f":"IF(COUNTA('Template 100 students'!E18,'Template 100 students'!D18)=2,('Template 100 students'!$D$55),\"\")","v":22},{"$f":"IF(COUNTA('Template 100 students'!E18,'Template 100 students'!D18)=2,('Template 100 students'!$E$104),\"\")","v":1.1766605171564554E-2}]
[{"$f":"IF(COUNTA('Template 30 students'!B19)=1,('Template 30 students'!B19),\"\")","v":"Etudiant 16"},{"$f":"IF(COUNTA('Template 30 students'!E19)=1,('Template 30 students'!E19),\"\")","v":""},{"$f":"IF(COUNTA('Template 30 students'!D19)=1,('Template 30 students'!D19),\"\")","v":""},{"$f":"IF(COUNTA('Template 30 students'!E19,'Template 30 students'!D19)=2,('Template 30 students'!$D$34),\"\")","v":""},{"$f":"IF(COUNTA('Template 30 students'!E19,'Template 30 students'!D19)=2,AVERAGE($B$2:$B$31),\"\")","v":""},null,{"$f":"IF(COUNTA('Template 50 students'!B19)=1,('Template 50 students'!B19),\"\")","v":"Student17"},{"$f":"IF(COUNTA('Template 50 students'!E19)=1,('Template 50 students'!E19),\"\")","v":-1.9978630258404142},{"$f":"IF(COUNTA('Template 50 students'!D19)=1,('Template 50 students'!D19),\"\")","v":35},{"$f":"IF(COUNTA('Template 50 students'!E19,'Template 50 students'!D19)=2,('Template 50 students'!$D$55),\"\")","v":55.66},{"$f":"IF(COUNTA('Template 50 students'!E19,'Template 50 students'!D19)=2,('Template 50 students'!$E$55),\"\")","v":-6.1894580016232652E-2},null,null,{"$f":"'Template 100 students'!E19","v":0.16809435959377866},{"$f":"IF(COUNTA('Template 100 students'!D19)=1,('Template 100 students'!D19),\"\")","v":24},{"$f":"IF(COUNTA('Template 100 students'!E19,'Template 100 students'!D19)=2,('Template 100 students'!$D$55),\"\")","v":22},{"$f":"IF(COUNTA('Template 100 students'!E19,'Template 100 students'!D19)=2,('Template 100 students'!$E$104),\"\")","v":1.1766605171564554E-2}]
[{"$f":"IF(COUNTA('Template 30 students'!B20)=1,('Template 30 students'!B20),\"\")","v":"Etudiant 17"},{"$f":"IF(COUNTA('Template 30 students'!E20)=1,('Template 30 students'!E20),\"\")","v":""},{"$f":"IF(COUNTA('Template 30 students'!D20)=1,('Template 30 students'!D20),\"\")","v":""},{"$f":"IF(COUNTA('Template 30 students'!E20,'Template 30 students'!D20)=2,('Template 30 students'!$D$34),\"\")","v":""},{"$f":"IF(COUNTA('Template 30 students'!E20,'Template 30 students'!D20)=2,AVERAGE($B$2:$B$31),\"\")","v":""},null,{"$f":"IF(COUNTA('Template 50 students'!B20)=1,('Template 50 students'!B20),\"\")","v":"Student18"},{"$f":"IF(COUNTA('Template 50 students'!E20)=1,('Template 50 students'!E20),\"\")","v":-1.4886038231752106},{"$f":"IF(COUNTA('Template 50 students'!D20)=1,('Template 50 students'!D20),\"\")","v":20},{"$f":"IF(COUNTA('Template 50 students'!E20,'Template 50 students'!D20)=2,('Template 50 students'!$D$55),\"\")","v":55.66},{"$f":"IF(COUNTA('Template 50 students'!E20,'Template 50 students'!D20)=2,('Template 50 students'!$E$55),\"\")","v":-6.1894580016232652E-2},null,null,{"$f":"'Template 100 students'!E20","v":0.16809435959377866},{"$f":"IF(COUNTA('Template 100 students'!D20)=1,('Template 100 students'!D20),\"\")","v":31},{"$f":"IF(COUNTA('Template 100 students'!E20,'Template 100 students'!D20)=2,('Template 100 students'!$D$55),\"\")","v":22},{"$f":"IF(COUNTA('Template 100 students'!E20,'Template 100 students'!D20)=2,('Template 100 students'!$E$104),\"\")","v":1.1766605171564554E-2}]
[{"$f":"IF(COUNTA('Template 30 students'!B21)=1,('Template 30 students'!B21),\"\")","v":"Etudiant 18"},{"$f":"IF(COUNTA('Template 30 students'!E21)=1,('Template 30 students'!E21),\"\")","v":""},{"$f":"IF(COUNTA('Template 30 students'!D21)=1,('Template 30 students'!D21),\"\")","v":""},{"$f":"IF(COUNTA('Template 30 students'!E21,'Template 30 students'!D21)=2,('Template 30 students'!$D$34),\"\")","v":""},{"$f":"IF(COUNTA('Template 30 students'!E21,'Template 30 students'!D21)=2,AVERAGE($B$2:$B$31),\"\")","v":""},null,{"$f":"IF(COUNTA('Template 50 students'!B21)=1,('Template 50 students'!B21),\"\")","v":"Student19"},{"$f":"IF(COUNTA('Template 50 students'!E21)=1,('Template 50 students'!E21),\"\")","v":2.7421649374280195},{"$f":"IF(COUNTA('Template 50 students'!D21)=1,('Template 50 students'!D21),\"\")","v":88},{"$f":"IF(COUNTA('Template 50 students'!E21,'Template 50 students'!D21)=2,('Template 50 students'!$D$55),\"\")","v":55.66},{"$f":"IF(COUNTA('Template 50 students'!E21,'Template 50 students'!D21)=2,('Template 50 students'!$E$55),\"\")","v":-6.1894580016232652E-2},null,null,{"$f":"'Template 100 students'!E21","v":0.33618871918755733},{"$f":"IF(COUNTA('Template 100 students'!D21)=1,('Template 100 students'!D21),\"\")","v":24},{"$f":"IF(COUNTA('Template 100 students'!E21,'Template 100 students'!D21)=2,('Template 100 students'!$D$55),\"\")","v":22},{"$f":"IF(COUNTA('Template 100 students'!E21,'Template 100 students'!D21)=2,('Template 100 students'!$E$104),\"\")","v":1.1766605171564554E-2}]
[{"$f":"IF(COUNTA('Template 30 students'!B22)=1,('Template 30 students'!B22),\"\")","v":"Etudiant 19"},{"$f":"IF(COUNTA('Template 30 students'!E22)=1,('Template 30 students'!E22),\"\")","v":""},{"$f":"IF(COUNTA('Template 30 students'!D22)=1,('Template 30 students'!D22),\"\")","v":""},{"$f":"IF(COUNTA('Template 30 students'!E22,'Template 30 students'!D22)=2,('Template 30 students'!$D$34),\"\")","v":""},{"$f":"IF(COUNTA('Template 30 students'!E22,'Template 30 students'!D22)=2,AVERAGE($B$2:$B$31),\"\")","v":""},null,{"$f":"IF(COUNTA('Template 50 students'!B22)=1,('Template 50 students'!B22),\"\")","v":"Student20"},{"$f":"IF(COUNTA('Template 50 students'!E22)=1,('Template 50 students'!E22),\"\")","v":1.3710824687140097},{"$f":"IF(COUNTA('Template 50 students'!D22)=1,('Template 50 students'!D22),\"\")","v":56},{"$f":"IF(COUNTA('Template 50 students'!E22,'Template 50 students'!D22)=2,('Template 50 students'!$D$55),\"\")","v":55.66},{"$f":"IF(COUNTA('Template 50 students'!E22,'Template 50 students'!D22)=2,('Template 50 students'!$E$55),\"\")","v":-6.1894580016232652E-2},null,null,{"$f":"'Template 100 students'!E22","v":0.67237743837511466},{"$f":"IF(COUNTA('Template 100 students'!D22)=1,('Template 100 students'!D22),\"\")","v":28},{"$f":"IF(COUNTA('Template 100 students'!E22,'Template 100 students'!D22)=2,('Template 100 students'!$D$55),\"\")","v":22},{"$f":"IF(COUNTA('Template 100 students'!E22,'Template 100 students'!D22)=2,('Template 100 students'!$E$104),\"\")","v":1.1766605171564554E-2}]
[{"$f":"IF(COUNTA('Template 30 students'!B23)=1,('Template 30 students'!B23),\"\")","v":"Etudiant 20"},{"$f":"IF(COUNTA('Template 30 students'!E23)=1,('Template 30 students'!E23),\"\")","v":""},{"$f":"IF(COUNTA('Template 30 students'!D23)=1,('Template 30 students'!D23),\"\")","v":""},{"$f":"IF(COUNTA('Template 30 students'!E23,'Template 30 students'!D23)=2,('Template 30 students'!$D$34),\"\")","v":""},{"$f":"IF(COUNTA('Template 30 students'!E23,'Template 30 students'!D23)=2,AVERAGE($B$2:$B$31),\"\")","v":""},null,{"$f":"IF(COUNTA('Template 50 students'!B23)=1,('Template 50 students'!B23),\"\")","v":"Student21"},{"$f":"IF(COUNTA('Template 50 students'!E23)=1,('Template 50 students'!E23),\"\")","v":0.82264948122840575},{"$f":"IF(COUNTA('Template 50 students'!D23)=1,('Template 50 students'!D23),\"\")","v":77},{"$f":"IF(COUNTA('Template 50 students'!E23,'Template 50 students'!D23)=2,('Template 50 students'!$D$55),\"\")","v":55.66},{"$f":"IF(COUNTA('Template 50 students'!E23,'Template 50 students'!D23)=2,('Template 50 students'!$E$55),\"\")","v":-6.1894580016232652E-2},null,null,{"$f":"'Template 100 students'!E23","v":0},{"$f":"IF(COUNTA('Template 100 students'!D23)=1,('Template 100 students'!D23),\"\")","v":33},{"$f":"IF(COUNTA('Template 100 students'!E23,'Template 100 students'!D23)=2,('Template 100 students'!$D$55),\"\")","v":22},{"$f":"IF(COUNTA('Template 100 students'!E23,'Template 100 students'!D23)=2,('Template 100 students'!$E$104),\"\")","v":1.1766605171564554E-2}]
[{"$f":"IF(COUNTA('Template 30 students'!B24)=1,('Template 30 students'!B24),\"\")","v":"Etudiant 21"},{"$f":"IF(COUNTA('Template 30 students'!E24)=1,('Template 30 students'!E24),\"\")","v":""},{"$f":"IF(COUNTA('Template 30 students'!D24)=1,('Template 30 students'!D24),\"\")","v":""},{"$f":"IF(COUNTA('Template 30 students'!E24,'Template 30 students'!D24)=2,('Template 30 students'!$D$34),\"\")","v":""},{"$f":"IF(COUNTA('Template 30 students'!E24,'Template 30 students'!D24)=2,AVERAGE($B$2:$B$31),\"\")","v":""},null,{"$f":"IF(COUNTA('Template 50 students'!B24)=1,('Template 50 students'!B24),\"\")","v":"Student22"},{"$f":"IF(COUNTA('Template 50 students'!E24)=1,('Template 50 students'!E24),\"\")","v":0.70512812676720493},{"$f":"IF(COUNTA('Template 50 students'!D24)=1,('Template 50 students'!D24),\"\")","v":68},{"$f":"IF(COUNTA('Template 50 students'!E24,'Template 50 students'!D24)=2,('Template 50 students'!$D$55),\"\")","v":55.66},{"$f":"IF(COUNTA('Template 50 students'!E24,'Template 50 students'!D24)=2,('Template 50 students'!$E$55),\"\")","v":-6.1894580016232652E-2},null,null,{"$f":"'Template 100 students'!E24","v":-1.6809435959377865},{"$f":"IF(COUNTA('Template 100 students'!D24)=1,('Template 100 students'!D24),\"\")","v":28},{"$f":"IF(COUNTA('Template 100 students'!E24,'Template 100 students'!D24)=2,('Template 100 students'!$D$55),\"\")","v":22},{"$f":"IF(COUNTA('Template 100 students'!E24,'Template 100 students'!D24)=2,('Template 100 students'!$E$104),\"\")","v":1.1766605171564554E-2}]
[{"$f":"IF(COUNTA('Template 30 students'!B25)=1,('Template 30 students'!B25),\"\")","v":"Etudiant 22"},{"$f":"IF(COUNTA('Template 30 students'!E25)=1,('Template 30 students'!E25),\"\")","v":""},{"$f":"IF(COUNTA('Template 30 students'!D25)=1,('Template 30 students'!D25),\"\")","v":""},{"$f":"IF(COUNTA('Template 30 students'!E25,'Template 30 students'!D25)=2,('Template 30 students'!$D$34),\"\")","v":""},{"$f":"IF(COUNTA('Template 30 students'!E25,'Template 30 students'!D25)=2,AVERAGE($B$2:$B$31),\"\")","v":""},null,{"$f":"IF(COUNTA('Template 50 students'!B25)=1,('Template 50 students'!B25),\"\")","v":"Student23"},{"$f":"IF(COUNTA('Template 50 students'!E25)=1,('Template 50 students'!E25),\"\")","v":0.50925920266520364},{"$f":"IF(COUNTA('Template 50 students'!D25)=1,('Template 50 students'!D25),\"\")","v":39},{"$f":"IF(COUNTA('Template 50 students'!E25,'Template 50 students'!D25)=2,('Template 50 students'!$D$55),\"\")","v":55.66},{"$f":"IF(COUNTA('Template 50 students'!E25,'Template 50 students'!D25)=2,('Template 50 students'!$E$55),\"\")","v":-6.1894580016232652E-2},null,null,{"$f":"'Template 100 students'!E25","v":0},{"$f":"IF(COUNTA('Template 100 students'!D25)=1,('Template 100 students'!D25),\"\")","v":25},{"$f":"IF(COUNTA('Template 100 students'!E25,'Template 100 students'!D25)=2,('Template 100 students'!$D$55),\"\")","v":22},{"$f":"IF(COUNTA('Template 100 students'!E25,'Template 100 students'!D25)=2,('Template 100 students'!$E$104),\"\")","v":1.1766605171564554E-2}]
[{"$f":"IF(COUNTA('Template 30 students'!B26)=1,('Template 30 students'!B26),\"\")","v":"Etudiant 23"},{"$f":"IF(COUNTA('Template 30 students'!E26)=1,('Template 30 students'!E26),\"\")","v":""},{"$f":"IF(COUNTA('Template 30 students'!D26)=1,('Template 30 students'!D26),\"\")","v":""},{"$f":"IF(COUNTA('Template 30 students'!E26,'Template 30 students'!D26)=2,('Template 30 students'!$D$34),\"\")","v":""},{"$f":"IF(COUNTA('Template 30 students'!E26,'Template 30 students'!D26)=2,AVERAGE($B$2:$B$31),\"\")","v":""},null,{"$f":"IF(COUNTA('Template 50 students'!B26)=1,('Template 50 students'!B26),\"\")","v":"Student24"},{"$f":"IF(COUNTA('Template 50 students'!E26)=1,('Template 50 students'!E26),\"\")","v":-2.8988600767096204},{"$f":"IF(COUNTA('Template 50 students'!D26)=1,('Template 50 students'!D26),\"\")","v":21},{"$f":"IF(COUNTA('Template 50 students'!E26,'Template 50 students'!D26)=2,('Template 50 students'!$D$55),\"\")","v":55.66},{"$f":"IF(COUNTA('Template 50 students'!E26,'Template 50 students'!D26)=2,('Template 50 students'!$E$55),\"\")","v":-6.1894580016232652E-2},null,null,{"$f":"'Template 100 students'!E26","v":-0.16809435959377866},{"$f":"IF(COUNTA('Template 100 students'!D26)=1,('Template 100 students'!D26),\"\")","v":20},{"$f":"IF(COUNTA('Template 100 students'!E26,'Template 100 students'!D26)=2,('Template 100 students'!$D$55),\"\")","v":22},{"$f":"IF(COUNTA('Template 100 students'!E26,'Template 100 students'!D26)=2,('Template 100 students'!$E$104),\"\")","v":1.1766605171564554E-2}]
[{"$f":"IF(COUNTA('Template 30 students'!B27)=1,('Template 30 students'!B27),\"\")","v":"Etudiant 24"},{"$f":"IF(COUNTA('Template 30 students'!E27)=1,('Template 30 students'!E27),\"\")","v":""},{"$f":"IF(COUNTA('Template 30 students'!D27)=1,('Template 30 students'!D27),\"\")","v":""},{"$f":"IF(COUNTA('Template 30 students'!E27,'Template 30 students'!D27)=2,('Template 30 students'!$D$34),\"\")","v":""},{"$f":"IF(COUNTA('Template 30 students'!E27,'Template 30 students'!D27)=2,AVERAGE($B$2:$B$31),\"\")","v":""},null,{"$f":"IF(COUNTA('Template 50 students'!B27)=1,('Template 50 students'!B27),\"\")","v":"Student25"},{"$f":"IF(COUNTA('Template 50 students'!E27)=1,('Template 50 students'!E27),\"\")","v":1.3710824687140097},{"$f":"IF(COUNTA('Template 50 students'!D27)=1,('Template 50 students'!D27),\"\")","v":57},{"$f":"IF(COUNTA('Template 50 students'!E27,'Template 50 students'!D27)=2,('Template 50 students'!$D$55),\"\")","v":55.66},{"$f":"IF(COUNTA('Template 50 students'!E27,'Template 50 students'!D27)=2,('Template 50 students'!$E$55),\"\")","v":-6.1894580016232652E-2},null,null,{"$f":"'Template 100 students'!E27","v":-0.84047179796889326},{"$f":"IF(COUNTA('Template 100 students'!D27)=1,('Template 100 students'!D27),\"\")","v":34},{"$f":"IF(COUNTA('Template 100 students'!E27,'Template 100 students'!D27)=2,('Template 100 students'!$D$55),\"\")","v":22},{"$f":"IF(COUNTA('Template 100 students'!E27,'Template 100 students'!D27)=2,('Template 100 students'!$E$104),\"\")","v":1.1766605171564554E-2}]
[{"$f":"IF(COUNTA('Template 30 students'!B28)=1,('Template 30 students'!B28),\"\")","v":"Etudiant 25"},{"$f":"IF(COUNTA('Template 30 students'!E28)=1,('Template 30 students'!E28),\"\")","v":""},{"$f":"IF(COUNTA('Template 30 students'!D28)=1,('Template 30 students'!D28),\"\")","v":""},{"$f":"IF(COUNTA('Template 30 students'!E28,'Template 30 students'!D28)=2,('Template 30 students'!$D$34),\"\")","v":""},{"$f":"IF(COUNTA('Template 30 students'!E28,'Template 30 students'!D28)=2,AVERAGE($B$2:$B$31),\"\")","v":""},null,{"$f":"IF(COUNTA('Template 50 students'!B28)=1,('Template 50 students'!B28),\"\")","v":"Student26"},{"$f":"IF(COUNTA('Template 50 students'!E28)=1,('Template 50 students'!E28),\"\")","v":1.3319086838936094},{"$f":"IF(COUNTA('Template 50 students'!D28)=1,('Template 50 students'!D28),\"\")","v":82},{"$f":"IF(COUNTA('Template 50 students'!E28,'Template 50 students'!D28)=2,('Template 50 students'!$D$55),\"\")","v":55.66},{"$f":"IF(COUNTA('Template 50 students'!E28,'Template 50 students'!D28)=2,('Template 50 students'!$E$55),\"\")","v":-6.1894580016232652E-2},null,null,{"$f":"'Template 100 students'!E28","v":-0.50428307878133594},{"$f":"IF(COUNTA('Template 100 students'!D28)=1,('Template 100 students'!D28),\"\")","v":31},{"$f":"IF(COUNTA('Template 100 students'!E28,'Template 100 students'!D28)=2,('Template 100 students'!$D$55),\"\")","v":22},{"$f":"IF(COUNTA('Template 100 students'!E28,'Template 100 students'!D28)=2,('Template 100 students'!$E$104),\"\")","v":1.1766605171564554E-2}]
[{"$f":"IF(COUNTA('Template 30 students'!B29)=1,('Template 30 students'!B29),\"\")","v":"Etudiant 26"},{"$f":"IF(COUNTA('Template 30 students'!E29)=1,('Template 30 students'!E29),\"\")","v":""},{"$f":"IF(COUNTA('Template 30 students'!D29)=1,('Template 30 students'!D29),\"\")","v":""},{"$f":"IF(COUNTA('Template 30 students'!E29,'Template 30 students'!D29)=2,('Template 30 students'!$D$34),\"\")","v":""},{"$f":"IF(COUNTA('Template 30 students'!E29,'Template 30 students'!D29)=2,AVERAGE($B$2:$B$31),\"\")","v":""},null,{"$f":"IF(COUNTA('Template 50 students'!B29)=1,('Template 50 students'!B29),\"\")","v":"Student27"},{"$f":"IF(COUNTA('Template 50 students'!E29)=1,('Template 50 students'!E29),\"\")","v":-1.841167886558813},{"$f":"IF(COUNTA('Template 50 students'!D29)=1,('Template 50 students'!D29),\"\")","v":23},{"$f":"IF(COUNTA('Template 50 students'!E29,'Template 50 students'!D29)=2,('Template 50 students'!$D$55),\"\")","v":55.66},{"$f":"IF(COUNTA('Template 50 students'!E29,'Template 50 students'!D29)=2,('Template 50 students'!$E$55),\"\")","v":-6.1894580016232652E-2},null,null,{"$f":"'Template 100 students'!E29","v":-1.512849236344008},{"$f":"IF(COUNTA('Template 100 students'!D29)=1,('Template 100 students'!D29),\"\")","v":28},{"$f":"IF(COUNTA('Template 100 students'!E29,'Template 100 students'!D29)=2,('Template 100 students'!$D$55),\"\")","v":22},{"$f":"IF(COUNTA('Template 100 students'!E29,'Template 100 students'!D29)=2,('Template 100 students'!$E$104),\"\")","v":1.1766605171564554E-2}]
[{"$f":"IF(COUNTA('Template 30 students'!B30)=1,('Template 30 students'!B30),\"\")","v":"Etudiant 27"},{"$f":"IF(COUNTA('Template 30 students'!E30)=1,('Template 30 students'!E30),\"\")","v":""},{"$f":"IF(COUNTA('Template 30 students'!D30)=1,('Template 30 students'!D30),\"\")","v":""},{"$f":"IF(COUNTA('Template 30 students'!E30,'Template 30 students'!D30)=2,('Template 30 students'!$D$34),\"\")","v":""},{"$f":"IF(COUNTA('Template 30 students'!E30,'Template 30 students'!D30)=2,AVERAGE($B$2:$B$31),\"\")","v":""},null,{"$f":"IF(COUNTA('Template 50 students'!B30)=1,('Template 50 students'!B30),\"\")","v":"Student28"},{"$f":"IF(COUNTA('Template 50 students'!E30)=1,('Template 50 students'!E30),\"\")","v":-2.0370368106608145},{"$f":"IF(COUNTA('Template 50 students'!D30)=1,('Template 50 students'!D30),\"\")","v":28},{"$f":"IF(COUNTA('Template 50 students'!E30,'Template 50 students'!D30)=2,('Template 50 students'!$D$55),\"\")","v":55.66},{"$f":"IF(COUNTA('Template 50 students'!E30,'Template 50 students'!D30)=2,('Template 50 students'!$E$55),\"\")","v":-6.1894580016232652E-2},null,null,{"$f":"'Template 100 students'!E30","v":1.6809435959377865},{"$f":"IF(COUNTA('Template 100 students'!D30)=1,('Template 100 students'!D30),\"\")","v":31},{"$f":"IF(COUNTA('Template 100 students'!E30,'Template 100 students'!D30)=2,('Template 100 students'!$D$55),\"\")","v":22},{"$f":"IF(COUNTA('Template 100 students'!E30,'Template 100 students'!D30)=2,('Template 100 students'!$E$104),\"\")","v":1.1766605171564554E-2}]
[{"$f":"IF(COUNTA('Template 30 students'!B31)=1,('Template 30 students'!B31),\"\")","v":"Etudiant 28"},{"$f":"IF(COUNTA('Template 30 students'!E31)=1,('Template 30 students'!E31),\"\")","v":""},{"$f":"IF(COUNTA('Template 30 students'!D31)=1,('Template 30 students'!D31),\"\")","v":""},{"$f":"IF(COUNTA('Template 30 students'!E31,'Template 30 students'!D31)=2,('Template 30 students'!$D$34),\"\")","v":""},{"$f":"IF(COUNTA('Template 30 students'!E31,'Template 30 students'!D31)=2,AVERAGE($B$2:$B$31),\"\")","v":""},null,{"$f":"IF(COUNTA('Template 50 students'!B31)=1,('Template 50 students'!B31),\"\")","v":"Student29"},{"$f":"IF(COUNTA('Template 50 students'!E31)=1,('Template 50 students'!E31),\"\")","v":-1.4102562535344099},{"$f":"IF(COUNTA('Template 50 students'!D31)=1,('Template 50 students'!D31),\"\")","v":27},{"$f":"IF(COUNTA('Template 50 students'!E31,'Template 50 students'!D31)=2,('Template 50 students'!$D$55),\"\")","v":55.66},{"$f":"IF(COUNTA('Template 50 students'!E31,'Template 50 students'!D31)=2,('Template 50 students'!$E$55),\"\")","v":-6.1894580016232652E-2},null,null,{"$f":"'Template 100 students'!E31","v":1.6809435959377865},{"$f":"IF(COUNTA('Template 100 students'!D31)=1,('Template 100 students'!D31),\"\")","v":32},{"$f":"IF(COUNTA('Template 100 students'!E31,'Template 100 students'!D31)=2,('Template 100 students'!$D$55),\"\")","v":22},{"$f":"IF(COUNTA('Template 100 students'!E31,'Template 100 students'!D31)=2,('Template 100 students'!$E$104),\"\")","v":1.1766605171564554E-2}]
[{"$f":"IF(COUNTA('Template 30 students'!B32)=1,('Template 30 students'!B32),\"\")","v":"Etudiant 29"},{"$f":"IF(COUNTA('Template 30 students'!E32)=1,('Template 30 students'!E32),\"\")","v":""},{"$f":"IF(COUNTA('Template 30 students'!D32)=1,('Template 30 students'!D32),\"\")","v":""},{"$f":"IF(COUNTA('Template 30 students'!E32,'Template 30 students'!D32)=2,('Template 30 students'!$D$34),\"\")","v":""},{"$f":"IF(COUNTA('Template 30 students'!E32,'Template 30 students'!D32)=2,AVERAGE($B$2:$B$31),\"\")","v":""},null,{"$f":"IF(COUNTA('Template 50 students'!B32)=1,('Template 50 students'!B32),\"\")","v":"Student30"},{"$f":"IF(COUNTA('Template 50 students'!E32)=1,('Template 50 students'!E32),\"\")","v":-1.8803416713792134},{"$f":"IF(COUNTA('Template 50 students'!D32)=1,('Template 50 students'!D32),\"\")","v":11},{"$f":"IF(COUNTA('Template 50 students'!E32,'Template 50 students'!D32)=2,('Template 50 students'!$D$55),\"\")","v":55.66},{"$f":"IF(COUNTA('Template 50 students'!E32,'Template 50 students'!D32)=2,('Template 50 students'!$E$55),\"\")","v":-6.1894580016232652E-2},null,null,{"$f":"'Template 100 students'!E32","v":0.67237743837511466},{"$f":"IF(COUNTA('Template 100 students'!D32)=1,('Template 100 students'!D32),\"\")","v":29},{"$f":"IF(COUNTA('Template 100 students'!E32,'Template 100 students'!D32)=2,('Template 100 students'!$D$55),\"\")","v":22},{"$f":"IF(COUNTA('Template 100 students'!E32,'Template 100 students'!D32)=2,('Template 100 students'!$E$104),\"\")","v":1.1766605171564554E-2}]
[null,null,null,null,null,null,{"$f":"IF(COUNTA('Template 50 students'!B33)=1,('Template 50 students'!B33),\"\")","v":"Student31"},{"$f":"IF(COUNTA('Template 50 students'!E33)=1,('Template 50 students'!E33),\"\")","v":-0.97934462051000692},{"$f":"IF(COUNTA('Template 50 students'!D33)=1,('Template 50 students'!D33),\"\")","v":43},{"$f":"IF(COUNTA('Template 50 students'!E33,'Template 50 students'!D33)=2,('Template 50 students'!$D$55),\"\")","v":55.66},{"$f":"IF(COUNTA('Template 50 students'!E33,'Template 50 students'!D33)=2,('Template 50 students'!$E$55),\"\")","v":-6.1894580016232652E-2},null,null,{"$f":"'Template 100 students'!E33","v":-1.0085661575626719},{"$f":"IF(COUNTA('Template 100 students'!D33)=1,('Template 100 students'!D33),\"\")","v":30},{"$f":"IF(COUNTA('Template 100 students'!E33,'Template 100 students'!D33)=2,('Template 100 students'!$D$55),\"\")","v":22},{"$f":"IF(COUNTA('Template 100 students'!E33,'Template 100 students'!D33)=2,('Template 100 students'!$E$104),\"\")","v":1.1766605171564554E-2}]
["Min",{"$f":"E2","v":1.2208333295987113},{"$f":"MIN(C2:C31)-10","v":51.1},null,{"$f":"COUNT('Template 30 students'!D3:D32)","v":14},null,{"$f":"IF(COUNTA('Template 50 students'!B34)=1,('Template 50 students'!B34),\"\")","v":"Student32"},{"$f":"IF(COUNTA('Template 50 students'!E34)=1,('Template 50 students'!E34),\"\")","v":3.9173784820400279E-2},{"$f":"IF(COUNTA('Template 50 students'!D34)=1,('Template 50 students'!D34),\"\")","v":64},{"$f":"IF(COUNTA('Template 50 students'!E34,'Template 50 students'!D34)=2,('Template 50 students'!$D$55),\"\")","v":55.66},{"$f":"IF(COUNTA('Template 50 students'!E34,'Template 50 students'!D34)=2,('Template 50 students'!$E$55),\"\")","v":-6.1894580016232652E-2},null,null,{"$f":"'Template 100 students'!E34","v":-0.50428307878133594},{"$f":"IF(COUNTA('Template 100 students'!D34)=1,('Template 100 students'!D34),\"\")","v":22},{"$f":"IF(COUNTA('Template 100 students'!E34,'Template 100 students'!D34)=2,('Template 100 students'!$D$55),\"\")","v":22},{"$f":"IF(COUNTA('Template 100 students'!E34,'Template 100 students'!D34)=2,('Template 100 students'!$E$104),\"\")","v":1.1766605171564554E-2}]
["Max",{"$f":"E2","v":1.2208333295987113},{"$f":"MAX(C2:C31)+10","v":110},null,null,null,{"$f":"IF(COUNTA('Template 50 students'!B35)=1,('Template 50 students'!B35),\"\")","v":"Student33"},{"$f":"IF(COUNTA('Template 50 students'!E35)=1,('Template 50 students'!E35),\"\")","v":0.6659543419468047},{"$f":"IF(COUNTA('Template 50 students'!D35)=1,('Template 50 students'!D35),\"\")","v":62},{"$f":"IF(COUNTA('Template 50 students'!E35,'Template 50 students'!D35)=2,('Template 50 students'!$D$55),\"\")","v":55.66},{"$f":"IF(COUNTA('Template 50 students'!E35,'Template 50 students'!D35)=2,('Template 50 students'!$E$55),\"\")","v":-6.1894580016232652E-2},null,null,{"$f":"'Template 100 students'!E35","v":-1.1766605171564506},{"$f":"IF(COUNTA('Template 100 students'!D35)=1,('Template 100 students'!D35),\"\")","v":29},{"$f":"IF(COUNTA('Template 100 students'!E35,'Template 100 students'!D35)=2,('Template 100 students'!$D$55),\"\")","v":22},{"$f":"IF(COUNTA('Template 100 students'!E35,'Template 100 students'!D35)=2,('Template 100 students'!$E$104),\"\")","v":1.1766605171564554E-2}]
[null,{"$f":"MIN(B2:B31)","v":-0.34880952274248911},{"$f":"'Template 30 students'!$D$34","v":86.007142857142853},null,null,null,{"$f":"IF(COUNTA('Template 50 students'!B36)=1,('Template 50 students'!B36),\"\")","v":"Student34"},{"$f":"IF(COUNTA('Template 50 students'!E36)=1,('Template 50 students'!E36),\"\")","v":-0.43091163302440305},{"$f":"IF(COUNTA('Template 50 students'!D36)=1,('Template 50 students'!D36),\"\")","v":39},{"$f":"IF(COUNTA('Template 50 students'!E36,'Template 50 students'!D36)=2,('Template 50 students'!$D$55),\"\")","v":55.66},{"$f":"IF(COUNTA('Template 50 students'!E36,'Template 50 students'!D36)=2,('Template 50 students'!$E$55),\"\")","v":-6.1894580016232652E-2},null,null,{"$f":"'Template 100 students'!E36","v":2.8576041130942373},{"$f":"IF(COUNTA('Template 100 students'!D36)=1,('Template 100 students'!D36),\"\")","v":39},{"$f":"IF(COUNTA('Template 100 students'!E36,'Template 100 students'!D36)=2,('Template 100 students'!$D$55),\"\")","v":22},{"$f":"IF(COUNTA('Template 100 students'!E36,'Template 100 students'!D36)=2,('Template 100 students'!$E$104),\"\")","v":1.1766605171564554E-2}]
[null,{"$f":"MAX(B2:B31)","v":2.8575549363134667},{"$f":"'Template 30 students'!$D$34","v":86.007142857142853},null,null,null,{"$f":"IF(COUNTA('Template 50 students'!B37)=1,('Template 50 students'!B37),\"\")","v":"Student35"},{"$f":"IF(COUNTA('Template 50 students'!E37)=1,('Template 50 students'!E37),\"\")","v":2.7813387222484196},{"$f":"IF(COUNTA('Template 50 students'!D37)=1,('Template 50 students'!D37),\"\")","v":86},{"$f":"IF(COUNTA('Template 50 students'!E37,'Template 50 students'!D37)=2,('Template 50 students'!$D$55),\"\")","v":55.66},{"$f":"IF(COUNTA('Template 50 students'!E37,'Template 50 students'!D37)=2,('Template 50 students'!$E$55),\"\")","v":-6.1894580016232652E-2},null,null,{"$f":"'Template 100 students'!E37","v":-0.33618871918755733},{"$f":"IF(COUNTA('Template 100 students'!D37)=1,('Template 100 students'!D37),\"\")","v":23},{"$f":"IF(COUNTA('Template 100 students'!E37,'Template 100 students'!D37)=2,('Template 100 students'!$D$55),\"\")","v":22},{"$f":"IF(COUNTA('Template 100 students'!E37,'Template 100 students'!D37)=2,('Template 100 students'!$E$104),\"\")","v":1.1766605171564554E-2}]
[null,0.4,{"$f":"C33","v":51.1},null,null,null,{"$f":"IF(COUNTA('Template 50 students'!B38)=1,('Template 50 students'!B38),\"\")","v":"Student36"},{"$f":"IF(COUNTA('Template 50 students'!E38)=1,('Template 50 students'!E38),\"\")","v":0.47008541784480334},{"$f":"IF(COUNTA('Template 50 students'!D38)=1,('Template 50 students'!D38),\"\")","v":39},{"$f":"IF(COUNTA('Template 50 students'!E38,'Template 50 students'!D38)=2,('Template 50 students'!$D$55),\"\")","v":55.66},{"$f":"IF(COUNTA('Template 50 students'!E38,'Template 50 students'!D38)=2,('Template 50 students'!$E$55),\"\")","v":-6.1894580016232652E-2},null,null,{"$f":"'Template 100 students'!E38","v":0},{"$f":"IF(COUNTA('Template 100 students'!D38)=1,('Template 100 students'!D38),\"\")","v":33},{"$f":"IF(COUNTA('Template 100 students'!E38,'Template 100 students'!D38)=2,('Template 100 students'!$D$55),\"\")","v":22},{"$f":"IF(COUNTA('Template 100 students'!E38,'Template 100 students'!D38)=2,('Template 100 students'!$E$104),\"\")","v":1.1766605171564554E-2}]
[null,0.4,{"$f":"C34","v":110},null,null,null,{"$f":"IF(COUNTA('Template 50 students'!B39)=1,('Template 50 students'!B39),\"\")","v":"Student37"},{"$f":"IF(COUNTA('Template 50 students'!E39)=1,('Template 50 students'!E39),\"\")","v":-0.54843298748560387},{"$f":"IF(COUNTA('Template 50 students'!D39)=1,('Template 50 students'!D39),\"\")","v":47},{"$f":"IF(COUNTA('Template 50 students'!E39,'Template 50 students'!D39)=2,('Template 50 students'!$D$55),\"\")","v":55.66},{"$f":"IF(COUNTA('Template 50 students'!E39,'Template 50 students'!D39)=2,('Template 50 students'!$E$55),\"\")","v":-6.1894580016232652E-2},null,null,{"$f":"'Template 100 students'!E39","v":2.1852266747191225},{"$f":"IF(COUNTA('Template 100 students'!D39)=1,('Template 100 students'!D39),\"\")","v":39},{"$f":"IF(COUNTA('Template 100 students'!E39,'Template 100 students'!D39)=2,('Template 100 students'!$D$55),\"\")","v":22},{"$f":"IF(COUNTA('Template 100 students'!E39,'Template 100 students'!D39)=2,('Template 100 students'!$E$104),\"\")","v":1.1766605171564554E-2}]
[null,null,null,null,null,null,{"$f":"IF(COUNTA('Template 50 students'!B40)=1,('Template 50 students'!B40),\"\")","v":"Student38"},{"$f":"IF(COUNTA('Template 50 students'!E40)=1,('Template 50 students'!E40),\"\")","v":3.9173784820400279E-2},{"$f":"IF(COUNTA('Template 50 students'!D40)=1,('Template 50 students'!D40),\"\")","v":22},{"$f":"IF(COUNTA('Template 50 students'!E40,'Template 50 students'!D40)=2,('Template 50 students'!$D$55),\"\")","v":55.66},{"$f":"IF(COUNTA('Template 50 students'!E40,'Template 50 students'!D40)=2,('Template 50 students'!$E$55),\"\")","v":-6.1894580016232652E-2},null,null,{"$f":"'Template 100 students'!E40","v":-0.84047179796889326},{"$f":"IF(COUNTA('Template 100 students'!D40)=1,('Template 100 students'!D40),\"\")","v":21},{"$f":"IF(COUNTA('Template 100 students'!E40,'Template 100 students'!D40)=2,('Template 100 students'!$D$55),\"\")","v":22},{"$f":"IF(COUNTA('Template 100 students'!E40,'Template 100 students'!D40)=2,('Template 100 students'!$E$104),\"\")","v":1.1766605171564554E-2}]
[null,null,null,null,null,null,{"$f":"IF(COUNTA('Template 50 students'!B41)=1,('Template 50 students'!B41),\"\")","v":"Student39"},{"$f":"IF(COUNTA('Template 50 students'!E41)=1,('Template 50 students'!E41),\"\")","v":-0.27421649374280194},{"$f":"IF(COUNTA('Template 50 students'!D41)=1,('Template 50 students'!D41),\"\")","v":52},{"$f":"IF(COUNTA('Template 50 students'!E41,'Template 50 students'!D41)=2,('Template 50 students'!$D$55),\"\")","v":55.66},{"$f":"IF(COUNTA('Template 50 students'!E41,'Template 50 students'!D41)=2,('Template 50 students'!$E$55),\"\")","v":-6.1894580016232652E-2},null,null,{"$f":"'Template 100 students'!E41","v":-0.50428307878133594},{"$f":"IF(COUNTA('Template 100 students'!D41)=1,('Template 100 students'!D41),\"\")","v":33},{"$f":"IF(COUNTA('Template 100 students'!E41,'Template 100 students'!D41)=2,('Template 100 students'!$D$55),\"\")","v":22},{"$f":"IF(COUNTA('Template 100 students'!E41,'Template 100 students'!D41)=2,('Template 100 students'!$E$104),\"\")","v":1.1766605171564554E-2}]
[null,null,null,null,null,null,{"$f":"IF(COUNTA('Template 50 students'!B42)=1,('Template 50 students'!B42),\"\")","v":"Student40"},{"$f":"IF(COUNTA('Template 50 students'!E42)=1,('Template 50 students'!E42),\"\")","v":-1.0968659749712077},{"$f":"IF(COUNTA('Template 50 students'!D42)=1,('Template 50 students'!D42),\"\")","v":17},{"$f":"IF(COUNTA('Template 50 students'!E42,'Template 50 students'!D42)=2,('Template 50 students'!$D$55),\"\")","v":55.66},{"$f":"IF(COUNTA('Template 50 students'!E42,'Template 50 students'!D42)=2,('Template 50 students'!$E$55),\"\")","v":-6.1894580016232652E-2},null,null,{"$f":"'Template 100 students'!E42","v":-0.67237743837511466},{"$f":"IF(COUNTA('Template 100 students'!D42)=1,('Template 100 students'!D42),\"\")","v":31},{"$f":"IF(COUNTA('Template 100 students'!E42,'Template 100 students'!D42)=2,('Template 100 students'!$D$55),\"\")","v":22},{"$f":"IF(COUNTA('Template 100 students'!E42,'Template 100 students'!D42)=2,('Template 100 students'!$E$104),\"\")","v":1.1766605171564554E-2}]
[null,null,null,null,null,null,{"$f":"IF(COUNTA('Template 50 students'!B43)=1,('Template 50 students'!B43),\"\")","v":"Student41"},{"$f":"IF(COUNTA('Template 50 students'!E43)=1,('Template 50 students'!E43),\"\")","v":2.3504270892240164},{"$f":"IF(COUNTA('Template 50 students'!D43)=1,('Template 50 students'!D43),\"\")","v":82},{"$f":"IF(COUNTA('Template 50 students'!E43,'Template 50 students'!D43)=2,('Template 50 students'!$D$55),\"\")","v":55.66},{"$f":"IF(COUNTA('Template 50 students'!E43,'Template 50 students'!D43)=2,('Template 50 students'!$E$55),\"\")","v":-6.1894580016232652E-2},null,null,{"$f":"'Template 100 students'!E43","v":-2.3533210343129012},{"$f":"IF(COUNTA('Template 100 students'!D43)=1,('Template 100 students'!D43),\"\")","v":26},{"$f":"IF(COUNTA('Template 100 students'!E43,'Template 100 students'!D43)=2,('Template 100 students'!$D$55),\"\")","v":22},{"$f":"IF(COUNTA('Template 100 students'!E43,'Template 100 students'!D43)=2,('Template 100 students'!$E$104),\"\")","v":1.1766605171564554E-2}]
[null,null,null,null,null,null,{"$f":"IF(COUNTA('Template 50 students'!B44)=1,('Template 50 students'!B44),\"\")","v":"Student42"},{"$f":"IF(COUNTA('Template 50 students'!E44)=1,('Template 50 students'!E44),\"\")","v":2.546296013326018},{"$f":"IF(COUNTA('Template 50 students'!D44)=1,('Template 50 students'!D44),\"\")","v":90},{"$f":"IF(COUNTA('Template 50 students'!E44,'Template 50 students'!D44)=2,('Template 50 students'!$D$55),\"\")","v":55.66},{"$f":"IF(COUNTA('Template 50 students'!E44,'Template 50 students'!D44)=2,('Template 50 students'!$E$55),\"\")","v":-6.1894580016232652E-2},null,null,{"$f":"'Template 100 students'!E44","v":2.3533210343129012},{"$f":"IF(COUNTA('Template 100 students'!D44)=1,('Template 100 students'!D44),\"\")","v":35},{"$f":"IF(COUNTA('Template 100 students'!E44,'Template 100 students'!D44)=2,('Template 100 students'!$D$55),\"\")","v":22},{"$f":"IF(COUNTA('Template 100 students'!E44,'Template 100 students'!D44)=2,('Template 100 students'!$E$104),\"\")","v":1.1766605171564554E-2}]
[null,null,null,null,null,null,{"$f":"IF(COUNTA('Template 50 students'!B45)=1,('Template 50 students'!B45),\"\")","v":"Student43"},{"$f":"IF(COUNTA('Template 50 students'!E45)=1,('Template 50 students'!E45),\"\")","v":0.50925920266520364},{"$f":"IF(COUNTA('Template 50 students'!D45)=1,('Template 50 students'!D45),\"\")","v":81},{"$f":"IF(COUNTA('Template 50 students'!E45,'Template 50 students'!D45)=2,('Template 50 students'!$D$55),\"\")","v":55.66},{"$f":"IF(COUNTA('Template 50 students'!E45,'Template 50 students'!D45)=2,('Template 50 students'!$E$55),\"\")","v":-6.1894580016232652E-2},null,null,{"$f":"'Template 100 students'!E45","v":-0.84047179796889326},{"$f":"IF(COUNTA('Template 100 students'!D45)=1,('Template 100 students'!D45),\"\")","v":20},{"$f":"IF(COUNTA('Template 100 students'!E45,'Template 100 students'!D45)=2,('Template 100 students'!$D$55),\"\")","v":22},{"$f":"IF(COUNTA('Template 100 students'!E45,'Template 100 students'!D45)=2,('Template 100 students'!$E$104),\"\")","v":1.1766605171564554E-2}]
[null,null,null,null,null,null,{"$f":"IF(COUNTA('Template 50 students'!B46)=1,('Template 50 students'!B46),\"\")","v":"Student44"},{"$f":"IF(COUNTA('Template 50 students'!E46)=1,('Template 50 students'!E46),\"\")","v":-0.58760677230600411},{"$f":"IF(COUNTA('Template 50 students'!D46)=1,('Template 50 students'!D46),\"\")","v":61},{"$f":"IF(COUNTA('Template 50 students'!E46,'Template 50 students'!D46)=2,('Template 50 students'!$D$55),\"\")","v":55.66},{"$f":"IF(COUNTA('Template 50 students'!E46,'Template 50 students'!D46)=2,('Template 50 students'!$E$55),\"\")","v":-6.1894580016232652E-2},null,null,{"$f":"'Template 100 students'!E46","v":0.33618871918755733},{"$f":"IF(COUNTA('Template 100 students'!D46)=1,('Template 100 students'!D46),\"\")","v":33},{"$f":"IF(COUNTA('Template 100 students'!E46,'Template 100 students'!D46)=2,('Template 100 students'!$D$55),\"\")","v":22},{"$f":"IF(COUNTA('Template 100 students'!E46,'Template 100 students'!D46)=2,('Template 100 students'!$E$104),\"\")","v":1.1766605171564554E-2}]
[null,null,null,null,null,null,{"$f":"IF(COUNTA('Template 50 students'!B47)=1,('Template 50 students'!B47),\"\")","v":"Student45"},{"$f":"IF(COUNTA('Template 50 students'!E47)=1,('Template 50 students'!E47),\"\")","v":1.4494300383548102},{"$f":"IF(COUNTA('Template 50 students'!D47)=1,('Template 50 students'!D47),\"\")","v":63},{"$f":"IF(COUNTA('Template 50 students'!E47,'Template 50 students'!D47)=2,('Template 50 students'!$D$55),\"\")","v":55.66},{"$f":"IF(COUNTA('Template 50 students'!E47,'Template 50 students'!D47)=2,('Template 50 students'!$E$55),\"\")","v":-6.1894580016232652E-2},null,null,{"$f":"'Template 100 students'!E47","v":-1.6809435959377865},{"$f":"IF(COUNTA('Template 100 students'!D47)=1,('Template 100 students'!D47),\"\")","v":23},{"$f":"IF(COUNTA('Template 100 students'!E47,'Template 100 students'!D47)=2,('Template 100 students'!$D$55),\"\")","v":22},{"$f":"IF(COUNTA('Template 100 students'!E47,'Template 100 students'!D47)=2,('Template 100 students'!$E$104),\"\")","v":1.1766605171564554E-2}]
[null,null,null,null,null,null,{"$f":"IF(COUNTA('Template 50 students'!B48)=1,('Template 50 students'!B48),\"\")","v":"Student46"},{"$f":"IF(COUNTA('Template 50 students'!E48)=1,('Template 50 students'!E48),\"\")","v":0.94017083568960669},{"$f":"IF(COUNTA('Template 50 students'!D48)=1,('Template 50 students'!D48),\"\")","v":81},{"$f":"IF(COUNTA('Template 50 students'!E48,'Template 50 students'!D48)=2,('Template 50 students'!$D$55),\"\")","v":55.66},{"$f":"IF(COUNTA('Template 50 students'!E48,'Template 50 students'!D48)=2,('Template 50 students'!$E$55),\"\")","v":-6.1894580016232652E-2},null,null,{"$f":"'Template 100 students'!E48","v":0.33618871918755733},{"$f":"IF(COUNTA('Template 100 students'!D48)=1,('Template 100 students'!D48),\"\")","v":35},{"$f":"IF(COUNTA('Template 100 students'!E48,'Template 100 students'!D48)=2,('Template 100 students'!$D$55),\"\")","v":22},{"$f":"IF(COUNTA('Template 100 students'!E48,'Template 100 students'!D48)=2,('Template 100 students'!$E$104),\"\")","v":1.1766605171564554E-2}]
[null,null,null,null,null,null,{"$f":"IF(COUNTA('Template 50 students'!B49)=1,('Template 50 students'!B49),\"\")","v":"Student47"},{"$f":"IF(COUNTA('Template 50 students'!E49)=1,('Template 50 students'!E49),\"\")","v":-1.0185184053304073},{"$f":"IF(COUNTA('Template 50 students'!D49)=1,('Template 50 students'!D49),\"\")","v":14},{"$f":"IF(COUNTA('Template 50 students'!E49,'Template 50 students'!D49)=2,('Template 50 students'!$D$55),\"\")","v":55.66},{"$f":"IF(COUNTA('Template 50 students'!E49,'Template 50 students'!D49)=2,('Template 50 students'!$E$55),\"\")","v":-6.1894580016232652E-2},null,null,{"$f":"'Template 100 students'!E49","v":0.67237743837511466},{"$f":"IF(COUNTA('Template 100 students'!D49)=1,('Template 100 students'!D49),\"\")","v":31},{"$f":"IF(COUNTA('Template 100 students'!E49,'Template 100 students'!D49)=2,('Template 100 students'!$D$55),\"\")","v":22},{"$f":"IF(COUNTA('Template 100 students'!E49,'Template 100 students'!D49)=2,('Template 100 students'!$E$104),\"\")","v":1.1766605171564554E-2}]
[null,null,null,null,null,null,{"$f":"IF(COUNTA('Template 50 students'!B50)=1,('Template 50 students'!B50),\"\")","v":"Student48"},{"$f":"IF(COUNTA('Template 50 students'!E50)=1,('Template 50 students'!E50),\"\")","v":0.58760677230600411},{"$f":"IF(COUNTA('Template 50 students'!D50)=1,('Template 50 students'!D50),\"\")","v":90},{"$f":"IF(COUNTA('Template 50 students'!E50,'Template 50 students'!D50)=2,('Template 50 students'!$D$55),\"\")","v":55.66},{"$f":"IF(COUNTA('Template 50 students'!E50,'Template 50 students'!D50)=2,('Template 50 students'!$E$55),\"\")","v":-6.1894580016232652E-2},null,null,{"$f":"'Template 100 students'!E50","v":-1.512849236344008},{"$f":"IF(COUNTA('Template 100 students'!D50)=1,('Template 100 students'!D50),\"\")","v":25},{"$f":"IF(COUNTA('Template 100 students'!E50,'Template 100 students'!D50)=2,('Template 100 students'!$D$55),\"\")","v":22},{"$f":"IF(COUNTA('Template 100 students'!E50,'Template 100 students'!D50)=2,('Template 100 students'!$E$104),\"\")","v":1.1766605171564554E-2}]
[null,null,null,null,null,null,{"$f":"IF(COUNTA('Template 50 students'!B51)=1,('Template 50 students'!B51),\"\")","v":"Student49"},{"$f":"IF(COUNTA('Template 50 students'!E51)=1,('Template 50 students'!E51),\"\")","v":-7.8347569640800557E-2},{"$f":"IF(COUNTA('Template 50 students'!D51)=1,('Template 50 students'!D51),\"\")","v":38},{"$f":"IF(COUNTA('Template 50 students'!E51,'Template 50 students'!D51)=2,('Template 50 students'!$D$55),\"\")","v":55.66},{"$f":"IF(COUNTA('Template 50 students'!E51,'Template 50 students'!D51)=2,('Template 50 students'!$E$55),\"\")","v":-6.1894580016232652E-2},null,null,{"$f":"'Template 100 students'!E51","v":-2.1852266747191225},{"$f":"IF(COUNTA('Template 100 students'!D51)=1,('Template 100 students'!D51),\"\")","v":27},{"$f":"IF(COUNTA('Template 100 students'!E51,'Template 100 students'!D51)=2,('Template 100 students'!$D$55),\"\")","v":22},{"$f":"IF(COUNTA('Template 100 students'!E51,'Template 100 students'!D51)=2,('Template 100 students'!$E$104),\"\")","v":1.1766605171564554E-2}]
[null,null,null,null,null,null,{"$f":"IF(COUNTA('Template 50 students'!B52)=1,('Template 50 students'!B52),\"\")","v":"Student50"},{"$f":"IF(COUNTA('Template 50 students'!E52)=1,('Template 50 students'!E52),\"\")","v":-3.9173784820400279E-2},{"$f":"IF(COUNTA('Template 50 students'!D52)=1,('Template 50 students'!D52),\"\")","v":39},{"$f":"IF(COUNTA('Template 50 students'!E52,'Template 50 students'!D52)=2,('Template 50 students'!$D$55),\"\")","v":55.66},{"$f":"IF(COUNTA('Template 50 students'!E52,'Template 50 students'!D52)=2,('Template 50 students'!$E$55),\"\")","v":-6.1894580016232652E-2},null,null,{"$f":"'Template 100 students'!E52","v":-0.50428307878133594},{"$f":"IF(COUNTA('Template 100 students'!D52)=1,('Template 100 students'!D52),\"\")","v":21},{"$f":"IF(COUNTA('Template 100 students'!E52,'Template 100 students'!D52)=2,('Template 100 students'!$D$55),\"\")","v":22},{"$f":"IF(COUNTA('Template 100 students'!E52,'Template 100 students'!D52)=2,('Template 100 students'!$E$104),\"\")","v":1.1766605171564554E-2}]
[null,null,null,null,null,null,null,null,null,null,null,null,null,{"$f":"'Template 100 students'!E53","v":-3.0256984726880161},{"$f":"IF(COUNTA('Template 100 students'!D53)=1,('Template 100 students'!D53),\"\")","v":22},{"$f":"IF(COUNTA('Template 100 students'!E53,'Template 100 students'!D53)=2,('Template 100 students'!$D$55),\"\")","v":22},{"$f":"IF(COUNTA('Template 100 students'!E53,'Template 100 students'!D53)=2,('Template 100 students'!$E$104),\"\")","v":1.1766605171564554E-2}]
[null,null,null,null,null,null,"Min",{"$f":"K2","v":-6.1894580016232652E-2},{"$f":"MIN(I2:I51)-10","v":1},null,{"$f":"COUNT(Table13[Effect size])","v":50},null,null,{"$f":"'Template 100 students'!E54","v":-2.3533210343129012},{"$f":"IF(COUNTA('Template 100 students'!D54)=1,('Template 100 students'!D54),\"\")","v":25},{"$f":"IF(COUNTA('Template 100 students'!E54,'Template 100 students'!D54)=2,('Template 100 students'!$D$55),\"\")","v":22},{"$f":"IF(COUNTA('Template 100 students'!E54,'Template 100 students'!D54)=2,('Template 100 students'!$E$104),\"\")","v":1.1766605171564554E-2}]
[null,null,null,null,null,null,"Max",{"$f":"K2","v":-6.1894580016232652E-2},{"$f":"MAX(I2:I51)+10","v":110},null,null,null,null,{"$f":"'Template 100 students'!E55","v":-1.512849236344008},{"$f":"IF(COUNTA('Template 100 students'!D55)=1,('Template 100 students'!D55),\"\")","v":22},{"$f":"IF(COUNTA('Template 100 students'!E55,'Template 100 students'!D55)=2,('Template 100 students'!$D$55),\"\")","v":22},{"$f":"IF(COUNTA('Template 100 students'!E55,'Template 100 students'!D55)=2,('Template 100 students'!$E$104),\"\")","v":1.1766605171564554E-2}]
[null,null,null,null,null,null,null,{"$f":"MIN(H2:H51)","v":-2.8988600767096204},{"$f":"'Template 50 students'!$D$55","v":55.66},null,null,null,null,{"$f":"'Template 100 students'!E56","v":-1.512849236344008},{"$f":"IF(COUNTA('Template 100 students'!D56)=1,('Template 100 students'!D56),\"\")","v":24},{"$f":"IF(COUNTA('Template 100 students'!E56,'Template 100 students'!D56)=2,('Template 100 students'!$D$55),\"\")","v":22},{"$f":"IF(COUNTA('Template 100 students'!E56,'Template 100 students'!D56)=2,('Template 100 students'!$E$104),\"\")","v":1.1766605171564554E-2}]
[null,null,null,null,null,null,null,{"$f":"MAX(H2:H51)","v":2.7813387222484196},{"$f":"'Template 50 students'!$D$55","v":55.66},null,null,null,null,{"$f":"'Template 100 students'!E57","v":1.3447548767502293},{"$f":"IF(COUNTA('Template 100 students'!D57)=1,('Template 100 students'!D57),\"\")","v":35},{"$f":"IF(COUNTA('Template 100 students'!E57,'Template 100 students'!D57)=2,('Template 100 students'!$D$55),\"\")","v":22},{"$f":"IF(COUNTA('Template 100 students'!E57,'Template 100 students'!D57)=2,('Template 100 students'!$E$104),\"\")","v":1.1766605171564554E-2}]
[null,null,null,null,null,null,null,0.4,{"$f":"I53","v":1},null,null,null,null,{"$f":"'Template 100 students'!E58","v":-2.8576041130942373},{"$f":"IF(COUNTA('Template 100 students'!D58)=1,('Template 100 students'!D58),\"\")","v":23},{"$f":"IF(COUNTA('Template 100 students'!E58,'Template 100 students'!D58)=2,('Template 100 students'!$D$55),\"\")","v":22},{"$f":"IF(COUNTA('Template 100 students'!E58,'Template 100 students'!D58)=2,('Template 100 students'!$E$104),\"\")","v":1.1766605171564554E-2}]
[null,null,null,null,null,null,null,0.4,{"$f":"I54","v":110},null,null,null,null,{"$f":"'Template 100 students'!E59","v":0.50428307878133594},{"$f":"IF(COUNTA('Template 100 students'!D59)=1,('Template 100 students'!D59),\"\")","v":34},{"$f":"IF(COUNTA('Template 100 students'!E59,'Template 100 students'!D59)=2,('Template 100 students'!$D$55),\"\")","v":22},{"$f":"IF(COUNTA('Template 100 students'!E59,'Template 100 students'!D59)=2,('Template 100 students'!$E$104),\"\")","v":1.1766605171564554E-2}]
[null,null,null,null,null,null,null,null,null,null,null,null,null,{"$f":"'Template 100 students'!E60","v":1.8490379555315652},{"$f":"IF(COUNTA('Template 100 students'!D60)=1,('Template 100 students'!D60),\"\")","v":39},{"$f":"IF(COUNTA('Template 100 students'!E60,'Template 100 students'!D60)=2,('Template 100 students'!$D$55),\"\")","v":22},{"$f":"IF(COUNTA('Template 100 students'!E60,'Template 100 students'!D60)=2,('Template 100 students'!$E$104),\"\")","v":1.1766605171564554E-2}]
[null,null,null,null,null,null,null,null,null,null,null,null,null,{"$f":"'Template 100 students'!E61","v":0},{"$f":"IF(COUNTA('Template 100 students'!D61)=1,('Template 100 students'!D61),\"\")","v":24},{"$f":"IF(COUNTA('Template 100 students'!E61,'Template 100 students'!D61)=2,('Template 100 students'!$D$55),\"\")","v":22},{"$f":"IF(COUNTA('Template 100 students'!E61,'Template 100 students'!D61)=2,('Template 100 students'!$E$104),\"\")","v":1.1766605171564554E-2}]
[null,null,null,null,null,null,null,null,null,null,null,null,null,{"$f":"'Template 100 students'!E62","v":-1.8490379555315652},{"$f":"IF(COUNTA('Template 100 students'!D62)=1,('Template 100 students'!D62),\"\")","v":28},{"$f":"IF(COUNTA('Template 100 students'!E62,'Template 100 students'!D62)=2,('Template 100 students'!$D$55),\"\")","v":22},{"$f":"IF(COUNTA('Template 100 students'!E62,'Template 100 students'!D62)=2,('Template 100 students'!$E$104),\"\")","v":1.1766605171564554E-2}]
[null,null,null,null,null,null,null,null,null,null,null,null,null,{"$f":"'Template 100 students'!E63","v":-0.16809435959377866},{"$f":"IF(COUNTA('Template 100 students'!D63)=1,('Template 100 students'!D63),\"\")","v":32},{"$f":"IF(COUNTA('Template 100 students'!E63,'Template 100 students'!D63)=2,('Template 100 students'!$D$55),\"\")","v":22},{"$f":"IF(COUNTA('Template 100 students'!E63,'Template 100 students'!D63)=2,('Template 100 students'!$E$104),\"\")","v":1.1766605171564554E-2}]
[null,null,null,null,null,null,null,null,null,null,null,null,null,{"$f":"'Template 100 students'!E64","v":1.0085661575626719},{"$f":"IF(COUNTA('Template 100 students'!D64)=1,('Template 100 students'!D64),\"\")","v":39},{"$f":"IF(COUNTA('Template 100 students'!E64,'Template 100 students'!D64)=2,('Template 100 students'!$D$55),\"\")","v":22},{"$f":"IF(COUNTA('Template 100 students'!E64,'Template 100 students'!D64)=2,('Template 100 students'!$E$104),\"\")","v":1.1766605171564554E-2}]
[null,null,null,null,null,null,null,null,null,null,null,null,null,{"$f":"'Template 100 students'!E65","v":-2.5214153939066799},{"$f":"IF(COUNTA('Template 100 students'!D65)=1,('Template 100 students'!D65),\"\")","v":25},{"$f":"IF(COUNTA('Template 100 students'!E65,'Template 100 students'!D65)=2,('Template 100 students'!$D$55),\"\")","v":22},{"$f":"IF(COUNTA('Template 100 students'!E65,'Template 100 students'!D65)=2,('Template 100 students'!$E$104),\"\")","v":1.1766605171564554E-2}]
[null,null,null,null,null,null,null,null,null,null,null,null,null,{"$f":"'Template 100 students'!E66","v":-1.8490379555315652},{"$f":"IF(COUNTA('Template 100 students'!D66)=1,('Template 100 students'!D66),\"\")","v":25},{"$f":"IF(COUNTA('Template 100 students'!E66,'Template 100 students'!D66)=2,('Template 100 students'!$D$55),\"\")","v":22},{"$f":"IF(COUNTA('Template 100 students'!E66,'Template 100 students'!D66)=2,('Template 100 students'!$E$104),\"\")","v":1.1766605171564554E-2}]
[null,null,null,null,null,null,null,null,null,null,null,null,null,{"$f":"'Template 100 students'!E67","v":1.6809435959377865},{"$f":"IF(COUNTA('Template 100 students'!D67)=1,('Template 100 students'!D67),\"\")","v":30},{"$f":"IF(COUNTA('Template 100 students'!E67,'Template 100 students'!D67)=2,('Template 100 students'!$D$55),\"\")","v":22},{"$f":"IF(COUNTA('Template 100 students'!E67,'Template 100 students'!D67)=2,('Template 100 students'!$E$104),\"\")","v":1.1766605171564554E-2}]
[null,null,null,null,null,null,null,null,null,null,null,null,null,{"$f":"'Template 100 students'!E68","v":0.33618871918755733},{"$f":"IF(COUNTA('Template 100 students'!D68)=1,('Template 100 students'!D68),\"\")","v":31},{"$f":"IF(COUNTA('Template 100 students'!E68,'Template 100 students'!D68)=2,('Template 100 students'!$D$55),\"\")","v":22},{"$f":"IF(COUNTA('Template 100 students'!E68,'Template 100 students'!D68)=2,('Template 100 students'!$E$104),\"\")","v":1.1766605171564554E-2}]
[null,null,null,null,null,null,null,null,null,null,null,null,null,{"$f":"'Template 100 students'!E69","v":0.50428307878133594},{"$f":"IF(COUNTA('Template 100 students'!D69)=1,('Template 100 students'!D69),\"\")","v":31},{"$f":"IF(COUNTA('Template 100 students'!E69,'Template 100 students'!D69)=2,('Template 100 students'!$D$55),\"\")","v":22},{"$f":"IF(COUNTA('Template 100 students'!E69,'Template 100 students'!D69)=2,('Template 100 students'!$E$104),\"\")","v":1.1766605171564554E-2}]
[null,null,null,null,null,null,null,null,null,null,null,null,null,{"$f":"'Template 100 students'!E70","v":-1.1766605171564506},{"$f":"IF(COUNTA('Template 100 students'!D70)=1,('Template 100 students'!D70),\"\")","v":31},{"$f":"IF(COUNTA('Template 100 students'!E70,'Template 100 students'!D70)=2,('Template 100 students'!$D$55),\"\")","v":22},{"$f":"IF(COUNTA('Template 100 students'!E70,'Template 100 students'!D70)=2,('Template 100 students'!$E$104),\"\")","v":1.1766605171564554E-2}]
[null,null,null,null,null,null,null,null,null,null,null,null,null,{"$f":"'Template 100 students'!E71","v":-1.1766605171564506},{"$f":"IF(COUNTA('Template 100 students'!D71)=1,('Template 100 students'!D71),\"\")","v":30},{"$f":"IF(COUNTA('Template 100 students'!E71,'Template 100 students'!D71)=2,('Template 100 students'!$D$55),\"\")","v":22},{"$f":"IF(COUNTA('Template 100 students'!E71,'Template 100 students'!D71)=2,('Template 100 students'!$E$104),\"\")","v":1.1766605171564554E-2}]
[null,null,null,null,null,null,null,null,null,null,null,null,null,{"$f":"'Template 100 students'!E72","v":1.512849236344008},{"$f":"IF(COUNTA('Template 100 students'!D72)=1,('Template 100 students'!D72),\"\")","v":35},{"$f":"IF(COUNTA('Template 100 students'!E72,'Template 100 students'!D72)=2,('Template 100 students'!$D$55),\"\")","v":22},{"$f":"IF(COUNTA('Template 100 students'!E72,'Template 100 students'!D72)=2,('Template 100 students'!$E$104),\"\")","v":1.1766605171564554E-2}]
[null,null,null,null,null,null,null,null,null,null,null,null,null,{"$f":"'Template 100 students'!E73","v":2.1852266747191225},{"$f":"IF(COUNTA('Template 100 students'!D73)=1,('Template 100 students'!D73),\"\")","v":34},{"$f":"IF(COUNTA('Template 100 students'!E73,'Template 100 students'!D73)=2,('Template 100 students'!$D$55),\"\")","v":22},{"$f":"IF(COUNTA('Template 100 students'!E73,'Template 100 students'!D73)=2,('Template 100 students'!$E$104),\"\")","v":1.1766605171564554E-2}]
[null,null,null,null,null,null,null,null,null,null,null,null,null,{"$f":"'Template 100 students'!E74","v":-1.8490379555315652},{"$f":"IF(COUNTA('Template 100 students'!D74)=1,('Template 100 students'!D74),\"\")","v":28},{"$f":"IF(COUNTA('Template 100 students'!E74,'Template 100 students'!D74)=2,('Template 100 students'!$D$55),\"\")","v":22},{"$f":"IF(COUNTA('Template 100 students'!E74,'Template 100 students'!D74)=2,('Template 100 students'!$E$104),\"\")","v":1.1766605171564554E-2}]
[null,null,null,null,null,null,null,null,null,null,null,null,null,{"$f":"'Template 100 students'!E75","v":1.512849236344008},{"$f":"IF(COUNTA('Template 100 students'!D75)=1,('Template 100 students'!D75),\"\")","v":31},{"$f":"IF(COUNTA('Template 100 students'!E75,'Template 100 students'!D75)=2,('Template 100 students'!$D$55),\"\")","v":22},{"$f":"IF(COUNTA('Template 100 students'!E75,'Template 100 students'!D75)=2,('Template 100 students'!$E$104),\"\")","v":1.1766605171564554E-2}]
[null,null,null,null,null,null,null,null,null,null,null,null,null,{"$f":"'Template 100 students'!E76","v":1.6809435959377865},{"$f":"IF(COUNTA('Template 100 students'!D76)=1,('Template 100 students'!D76),\"\")","v":36},{"$f":"IF(COUNTA('Template 100 students'!E76,'Template 100 students'!D76)=2,('Template 100 students'!$D$55),\"\")","v":22},{"$f":"IF(COUNTA('Template 100 students'!E76,'Template 100 students'!D76)=2,('Template 100 students'!$E$104),\"\")","v":1.1766605171564554E-2}]
[null,null,null,null,null,null,null,null,null,null,null,null,null,{"$f":"'Template 100 students'!E77","v":1.0085661575626719},{"$f":"IF(COUNTA('Template 100 students'!D77)=1,('Template 100 students'!D77),\"\")","v":29},{"$f":"IF(COUNTA('Template 100 students'!E77,'Template 100 students'!D77)=2,('Template 100 students'!$D$55),\"\")","v":22},{"$f":"IF(COUNTA('Template 100 students'!E77,'Template 100 students'!D77)=2,('Template 100 students'!$E$104),\"\")","v":1.1766605171564554E-2}]
[null,null,null,null,null,null,null,null,null,null,null,null,null,{"$f":"'Template 100 students'!E78","v":0.84047179796889326},{"$f":"IF(COUNTA('Template 100 students'!D78)=1,('Template 100 students'!D78),\"\")","v":36},{"$f":"IF(COUNTA('Template 100 students'!E78,'Template 100 students'!D78)=2,('Template 100 students'!$D$55),\"\")","v":22},{"$f":"IF(COUNTA('Template 100 students'!E78,'Template 100 students'!D78)=2,('Template 100 students'!$E$104),\"\")","v":1.1766605171564554E-2}]
[null,null,null,null,null,null,null,null,null,null,null,null,null,{"$f":"'Template 100 students'!E79","v":2.0171323151253437},{"$f":"IF(COUNTA('Template 100 students'!D79)=1,('Template 100 students'!D79),\"\")","v":32},{"$f":"IF(COUNTA('Template 100 students'!E79,'Template 100 students'!D79)=2,('Template 100 students'!$D$55),\"\")","v":22},{"$f":"IF(COUNTA('Template 100 students'!E79,'Template 100 students'!D79)=2,('Template 100 students'!$E$104),\"\")","v":1.1766605171564554E-2}]
[null,null,null,null,null,null,null,null,null,null,null,null,null,{"$f":"'Template 100 students'!E80","v":1.3447548767502293},{"$f":"IF(COUNTA('Template 100 students'!D80)=1,('Template 100 students'!D80),\"\")","v":40},{"$f":"IF(COUNTA('Template 100 students'!E80,'Template 100 students'!D80)=2,('Template 100 students'!$D$55),\"\")","v":22},{"$f":"IF(COUNTA('Template 100 students'!E80,'Template 100 students'!D80)=2,('Template 100 students'!$E$104),\"\")","v":1.1766605171564554E-2}]
[null,null,null,null,null,null,null,null,null,null,null,null,null,{"$f":"'Template 100 students'!E81","v":0},{"$f":"IF(COUNTA('Template 100 students'!D81)=1,('Template 100 students'!D81),\"\")","v":38},{"$f":"IF(COUNTA('Template 100 students'!E81,'Template 100 students'!D81)=2,('Template 100 students'!$D$55),\"\")","v":22},{"$f":"IF(COUNTA('Template 100 students'!E81,'Template 100 students'!D81)=2,('Template 100 students'!$E$104),\"\")","v":1.1766605171564554E-2}]
[null,null,null,null,null,null,null,null,null,null,null,null,null,{"$f":"'Template 100 students'!E82","v":2.1852266747191225},{"$f":"IF(COUNTA('Template 100 students'!D82)=1,('Template 100 students'!D82),\"\")","v":40},{"$f":"IF(COUNTA('Template 100 students'!E82,'Template 100 students'!D82)=2,('Template 100 students'!$D$55),\"\")","v":22},{"$f":"IF(COUNTA('Template 100 students'!E82,'Template 100 students'!D82)=2,('Template 100 students'!$E$104),\"\")","v":1.1766605171564554E-2}]
[null,null,null,null,null,null,null,null,null,null,null,null,null,{"$f":"'Template 100 students'!E83","v":-0.84047179796889326},{"$f":"IF(COUNTA('Template 100 students'!D83)=1,('Template 100 students'!D83),\"\")","v":26},{"$f":"IF(COUNTA('Template 100 students'!E83,'Template 100 students'!D83)=2,('Template 100 students'!$D$55),\"\")","v":22},{"$f":"IF(COUNTA('Template 100 students'!E83,'Template 100 students'!D83)=2,('Template 100 students'!$E$104),\"\")","v":1.1766605171564554E-2}]
[null,null,null,null,null,null,null,null,null,null,null,null,null,{"$f":"'Template 100 students'!E84","v":-0.33618871918755733},{"$f":"IF(COUNTA('Template 100 students'!D84)=1,('Template 100 students'!D84),\"\")","v":28},{"$f":"IF(COUNTA('Template 100 students'!E84,'Template 100 students'!D84)=2,('Template 100 students'!$D$55),\"\")","v":22},{"$f":"IF(COUNTA('Template 100 students'!E84,'Template 100 students'!D84)=2,('Template 100 students'!$E$104),\"\")","v":1.1766605171564554E-2}]
[null,null,null,null,null,null,null,null,null,null,null,null,null,{"$f":"'Template 100 students'!E85","v":1.6809435959377865},{"$f":"IF(COUNTA('Template 100 students'!D85)=1,('Template 100 students'!D85),\"\")","v":37},{"$f":"IF(COUNTA('Template 100 students'!E85,'Template 100 students'!D85)=2,('Template 100 students'!$D$55),\"\")","v":22},{"$f":"IF(COUNTA('Template 100 students'!E85,'Template 100 students'!D85)=2,('Template 100 students'!$E$104),\"\")","v":1.1766605171564554E-2}]
[null,null,null,null,null,null,null,null,null,null,null,null,null,{"$f":"'Template 100 students'!E86","v":-0.16809435959377866},{"$f":"IF(COUNTA('Template 100 students'!D86)=1,('Template 100 students'!D86),\"\")","v":30},{"$f":"IF(COUNTA('Template 100 students'!E86,'Template 100 students'!D86)=2,('Template 100 students'!$D$55),\"\")","v":22},{"$f":"IF(COUNTA('Template 100 students'!E86,'Template 100 students'!D86)=2,('Template 100 students'!$E$104),\"\")","v":1.1766605171564554E-2}]
[null,null,null,null,null,null,null,null,null,null,null,null,null,{"$f":"'Template 100 students'!E87","v":2.1852266747191225},{"$f":"IF(COUNTA('Template 100 students'!D87)=1,('Template 100 students'!D87),\"\")","v":37},{"$f":"IF(COUNTA('Template 100 students'!E87,'Template 100 students'!D87)=2,('Template 100 students'!$D$55),\"\")","v":22},{"$f":"IF(COUNTA('Template 100 students'!E87,'Template 100 students'!D87)=2,('Template 100 students'!$E$104),\"\")","v":1.1766605171564554E-2}]
[null,null,null,null,null,null,null,null,null,null,null,null,null,{"$f":"'Template 100 students'!E88","v":0},{"$f":"IF(COUNTA('Template 100 students'!D88)=1,('Template 100 students'!D88),\"\")","v":21},{"$f":"IF(COUNTA('Template 100 students'!E88,'Template 100 students'!D88)=2,('Template 100 students'!$D$55),\"\")","v":22},{"$f":"IF(COUNTA('Template 100 students'!E88,'Template 100 students'!D88)=2,('Template 100 students'!$E$104),\"\")","v":1.1766605171564554E-2}]
[null,null,null,null,null,null,null,null,null,null,null,null,null,{"$f":"'Template 100 students'!E89","v":0},{"$f":"IF(COUNTA('Template 100 students'!D89)=1,('Template 100 students'!D89),\"\")","v":22},{"$f":"IF(COUNTA('Template 100 students'!E89,'Template 100 students'!D89)=2,('Template 100 students'!$D$55),\"\")","v":22},{"$f":"IF(COUNTA('Template 100 students'!E89,'Template 100 students'!D89)=2,('Template 100 students'!$E$104),\"\")","v":1.1766605171564554E-2}]
[null,null,null,null,null,null,null,null,null,null,null,null,null,{"$f":"'Template 100 students'!E90","v":-1.6809435959377865},{"$f":"IF(COUNTA('Template 100 students'!D90)=1,('Template 100 students'!D90),\"\")","v":30},{"$f":"IF(COUNTA('Template 100 students'!E90,'Template 100 students'!D90)=2,('Template 100 students'!$D$55),\"\")","v":22},{"$f":"IF(COUNTA('Template 100 students'!E90,'Template 100 students'!D90)=2,('Template 100 students'!$E$104),\"\")","v":1.1766605171564554E-2}]
[null,null,null,null,null,null,null,null,null,null,null,null,null,{"$f":"'Template 100 students'!E91","v":-0.16809435959377866},{"$f":"IF(COUNTA('Template 100 students'!D91)=1,('Template 100 students'!D91),\"\")","v":39},{"$f":"IF(COUNTA('Template 100 students'!E91,'Template 100 students'!D91)=2,('Template 100 students'!$D$55),\"\")","v":22},{"$f":"IF(COUNTA('Template 100 students'!E91,'Template 100 students'!D91)=2,('Template 100 students'!$E$104),\"\")","v":1.1766605171564554E-2}]
[null,null,null,null,null,null,null,null,null,null,null,null,null,{"$f":"'Template 100 students'!E92","v":0.50428307878133594},{"$f":"IF(COUNTA('Template 100 students'!D92)=1,('Template 100 students'!D92),\"\")","v":32},{"$f":"IF(COUNTA('Template 100 students'!E92,'Template 100 students'!D92)=2,('Template 100 students'!$D$55),\"\")","v":22},{"$f":"IF(COUNTA('Template 100 students'!E92,'Template 100 students'!D92)=2,('Template 100 students'!$E$104),\"\")","v":1.1766605171564554E-2}]
[null,null,null,null,null,null,null,null,null,null,null,null,null,{"$f":"'Template 100 students'!E93","v":-0.33618871918755733},{"$f":"IF(COUNTA('Template 100 students'!D93)=1,('Template 100 students'!D93),\"\")","v":32},{"$f":"IF(COUNTA('Template 100 students'!E93,'Template 100 students'!D93)=2,('Template 100 students'!$D$55),\"\")","v":22},{"$f":"IF(COUNTA('Template 100 students'!E93,'Template 100 students'!D93)=2,('Template 100 students'!$E$104),\"\")","v":1.1766605171564554E-2}]
[null,null,null,null,null,null,null,null,null,null,null,null,null,{"$f":"'Template 100 students'!E94","v":0.67237743837511466},{"$f":"IF(COUNTA('Template 100 students'!D94)=1,('Template 100 students'!D94),\"\")","v":26},{"$f":"IF(COUNTA('Template 100 students'!E94,'Template 100 students'!D94)=2,('Template 100 students'!$D$55),\"\")","v":22},{"$f":"IF(COUNTA('Template 100 students'!E94,'Template 100 students'!D94)=2,('Template 100 students'!$E$104),\"\")","v":1.1766605171564554E-2}]
[null,null,null,null,null,null,null,null,null,null,null,null,null,{"$f":"'Template 100 students'!E95","v":0.67237743837511466},{"$f":"IF(COUNTA('Template 100 students'!D95)=1,('Template 100 students'!D95),\"\")","v":36},{"$f":"IF(COUNTA('Template 100 students'!E95,'Template 100 students'!D95)=2,('Template 100 students'!$D$55),\"\")","v":22},{"$f":"IF(COUNTA('Template 100 students'!E95,'Template 100 students'!D95)=2,('Template 100 students'!$E$104),\"\")","v":1.1766605171564554E-2}]
[null,null,null,null,null,null,null,null,null,null,null,null,null,{"$f":"'Template 100 students'!E96","v":2.6895097535004586},{"$f":"IF(COUNTA('Template 100 students'!D96)=1,('Template 100 students'!D96),\"\")","v":37},{"$f":"IF(COUNTA('Template 100 students'!E96,'Template 100 students'!D96)=2,('Template 100 students'!$D$55),\"\")","v":22},{"$f":"IF(COUNTA('Template 100 students'!E96,'Template 100 students'!D96)=2,('Template 100 students'!$E$104),\"\")","v":1.1766605171564554E-2}]
[null,null,null,null,null,null,null,null,null,null,null,null,null,{"$f":"'Template 100 students'!E97","v":-0.16809435959377866},{"$f":"IF(COUNTA('Template 100 students'!D97)=1,('Template 100 students'!D97),\"\")","v":20},{"$f":"IF(COUNTA('Template 100 students'!E97,'Template 100 students'!D97)=2,('Template 100 students'!$D$55),\"\")","v":22},{"$f":"IF(COUNTA('Template 100 students'!E97,'Template 100 students'!D97)=2,('Template 100 students'!$E$104),\"\")","v":1.1766605171564554E-2}]
[null,null,null,null,null,null,null,null,null,null,null,null,null,{"$f":"'Template 100 students'!E98","v":-1.1766605171564506},{"$f":"IF(COUNTA('Template 100 students'!D98)=1,('Template 100 students'!D98),\"\")","v":22},{"$f":"IF(COUNTA('Template 100 students'!E98,'Template 100 students'!D98)=2,('Template 100 students'!$D$55),\"\")","v":22},{"$f":"IF(COUNTA('Template 100 students'!E98,'Template 100 students'!D98)=2,('Template 100 students'!$E$104),\"\")","v":1.1766605171564554E-2}]
[null,null,null,null,null,null,null,null,null,null,null,null,null,{"$f":"'Template 100 students'!E99","v":1.512849236344008},{"$f":"IF(COUNTA('Template 100 students'!D99)=1,('Template 100 students'!D99),\"\")","v":37},{"$f":"IF(COUNTA('Template 100 students'!E99,'Template 100 students'!D99)=2,('Template 100 students'!$D$55),\"\")","v":22},{"$f":"IF(COUNTA('Template 100 students'!E99,'Template 100 students'!D99)=2,('Template 100 students'!$E$104),\"\")","v":1.1766605171564554E-2}]
[null,null,null,null,null,null,null,null,null,null,null,null,null,{"$f":"'Template 100 students'!E100","v":-2.3533210343129012},{"$f":"IF(COUNTA('Template 100 students'!D100)=1,('Template 100 students'!D100),\"\")","v":22},{"$f":"IF(COUNTA('Template 100 students'!E100,'Template 100 students'!D100)=2,('Template 100 students'!$D$55),\"\")","v":22},{"$f":"IF(COUNTA('Template 100 students'!E100,'Template 100 students'!D100)=2,('Template 100 students'!$E$104),\"\")","v":1.1766605171564554E-2}]
[null,null,null,null,null,null,null,null,null,null,null,null,null,{"$f":"'Template 100 students'!E101","v":0.84047179796889326},{"$f":"IF(COUNTA('Template 100 students'!D101)=1,('Template 100 students'!D101),\"\")","v":37},{"$f":"IF(COUNTA('Template 100 students'!E101,'Template 100 students'!D101)=2,('Template 100 students'!$D$55),\"\")","v":22},{"$f":"IF(COUNTA('Template 100 students'!E101,'Template 100 students'!D101)=2,('Template 100 students'!$E$104),\"\")","v":1.1766605171564554E-2}]
[null,null,null,null,null,null,null,null,null,null,null,null,null,{"$f":"'Template 100 students'!E102","v":1.3447548767502293},{"$f":"IF(COUNTA('Template 100 students'!D102)=1,('Template 100 students'!D102),\"\")","v":38},{"$f":"IF(COUNTA('Template 100 students'!E102,'Template 100 students'!D102)=2,('Template 100 students'!$D$55),\"\")","v":22},{"$f":"IF(COUNTA('Template 100 students'!E102,'Template 100 students'!D102)=2,('Template 100 students'!$E$104),\"\")","v":1.1766605171564554E-2}]
[]
[null,null,null,null,null,null,null,null,null,null,null,null,null,null,"Min",{"$f":"Q2","v":1.1766605171564554E-2},{"$f":"MIN(O2:O101)-10","v":10},{"$f":"COUNT(Table134[Effect size])","v":100}]
[null,null,null,null,null,null,null,null,null,null,null,null,null,null,"Max",{"$f":"Q2","v":1.1766605171564554E-2},{"$f":"MAX(O2:O101)+10","v":50}]
[null,null,null,null,null,null,null,null,null,null,null,null,null,null,null,{"$f":"MIN(N2:N101)","v":-3.0256984726880161},{"$f":"'Template 100 students'!$D$104","v":29.66}]
[null,null,null,null,null,null,null,null,null,null,null,null,null,null,null,{"$f":"MAX(N2:N101)","v":2.8576041130942373},{"$f":"'Template 100 students'!$D$104","v":29.66}]
[null,null,null,null,null,null,null,null,null,null,null,null,null,null,null,0.4,{"$f":"Q103","v":10}]
[null,null,null,null,null,null,null,null,null,null,null,null,null,null,null,0.4,{"$f":"Q104","v":50}]